{"text_format":"1","workbook":"xlsx","n_sheets":41,"sheets":["Menu","Bareme","Situations","Bilan","U11","U2","U31","U32","U33","U11_A","U11_B","U11_C","U11_D","U11_E","U11_F","U11_G","U11_H","U2_A","U2_B","U2_C","U2_D","U2_E","U2_F","U2_G","U2_H","U32_A","U32_B","U32_C","U32_D","U32_E","U32_F","U32_G","U32_H","U33_A","U33_B","U33_C","U33_D","U33_E","U33_F","U33_G","U33_H"],"not_rendered":{"charts":3,"images":5,"macros":1,"external_links":0,"defined_names":76,"comments":1,"pivot_tables":0},"unopened":[],"bounds":{"document_bytes":16777216,"sheet_cells":100000,"rows_first":2000,"rows_last":500,"rows_between":2000,"halvings":0,"cell_chars":16384,"cell_head_chars":4096},"cells_cut":0,"cells_raw":0,"read":"whole","date_system":"1900"}

{"sheet":"Menu","index":0,"n_rows":0,"n_cols":0,"rows_kept":0,"cut":false,"hidden":false,"merged":[]}

{"sheet":"Bareme","index":1,"n_rows":383,"n_cols":32,"rows_kept":383,"cut":false,"hidden":false,"merged":[[106,2,109,12],[104,30,105,30],[122,30,123,30],[124,30,125,30],[126,30,127,30],[74,0,77,1],[104,31,105,31],[96,0,97,1],[96,2,97,12],[98,0,99,1],[98,2,99,12],[100,0,101,1],[100,2,101,12],[90,0,91,1],[90,2,91,12],[92,0,93,1],[92,2,93,12],[94,0,95,1],[94,2,95,12],[102,13,103,29],[102,0,103,1],[102,2,103,12],[104,0,105,29],[80,31,81,31],[62,0,63,1],[62,2,63,12],[64,0,65,1],[64,2,65,12],[66,0,73,1],[66,2,73,12],[33,30,34,30],[35,30,36,30],[37,30,38,30],[39,30,40,30],[41,30,42,30],[43,30,44,30],[45,30,46,30],[47,30,48,30],[49,30,50,30],[29,0,34,1],[29,2,34,12],[35,0,40,1],[35,2,40,12],[29,13,30,29],[31,13,32,29],[33,13,34,29],[35,13,36,29],[37,13,38,29],[3,31,4,31],[5,30,6,30],[7,30,8,30],[9,30,10,30],[11,30,12,30],[13,30,14,30],[15,30,16,30],[17,30,18,30],[19,30,20,30],[21,30,22,30],[23,30,24,30],[25,30,26,30],[27,30,28,30],[25,31,26,31],[17,13,18,29],[19,13,20,29],[21,13,22,29],[23,13,24,29],[27,13,28,29],[21,0,24,1],[21,2,24,12],[25,0,26,29],[27,0,28,1],[27,2,28,12],[5,0,6,1],[5,2,6,12],[7,0,20,1],[7,2,20,12],[5,13,6,29],[7,13,8,29],[9,13,10,29],[11,13,12,29],[13,13,14,29],[15,13,16,29],[47,2,50,12],[47,13,48,29],[49,13,50,29],[53,30,54,30],[55,30,56,30],[58,30,59,30],[39,13,40,29],[29,30,30,30],[31,30,32,30],[318,30,319,30],[310,30,311,30],[312,30,313,30],[304,13,305,29],[288,0,289,29],[286,0,287,29],[306,30,307,30],[306,13,307,29],[296,0,297,1],[308,30,309,30],[304,30,305,30],[292,30,293,30],[290,0,295,1],[290,2,295,12],[310,2,313,12],[314,0,319,1],[314,2,319,12],[296,2,297,12],[298,0,309,1],[298,2,309,12],[294,13,295,29],[296,13,297,29],[298,13,299,29],[294,30,295,30],[131,31,132,31],[334,30,335,30],[334,13,335,29],[330,13,331,29],[332,13,333,29],[316,13,317,29],[318,13,319,29],[308,13,309,29],[310,13,311,29],[312,13,313,29],[314,13,315,29],[324,30,325,30],[326,30,327,30],[328,30,329,30],[330,30,331,30],[332,30,333,30],[316,30,317,30],[320,30,321,30],[322,30,323,30],[314,30,315,30],[248,13,249,29],[250,13,251,29],[252,13,253,29],[254,13,255,29],[223,30,224,30],[227,30,228,30],[229,30,230,30],[231,30,232,30],[233,30,234,30],[235,30,236,30],[237,30,238,30],[239,30,240,30],[241,30,242,30],[225,30,226,30],[213,30,214,30],[215,30,216,30],[217,30,218,30],[219,30,220,30],[221,30,222,30],[191,30,192,30],[193,30,194,30],[195,30,196,30],[197,30,198,30],[203,30,204,30],[205,30,206,30],[133,13,134,29],[336,0,337,29],[338,0,341,1],[338,2,341,12],[133,30,134,30],[131,30,132,30],[135,30,136,30],[137,30,138,30],[139,30,140,30],[141,30,142,30],[143,30,144,30],[145,30,146,30],[147,30,148,30],[149,30,150,30],[151,30,152,30],[153,30,154,30],[155,30,156,30],[157,30,158,30],[159,30,160,30],[161,30,162,30],[163,30,164,30],[207,30,208,30],[209,30,210,30],[211,30,212,30],[231,13,232,29],[233,13,234,29],[239,13,240,29],[241,13,242,29],[223,0,236,1],[254,0,257,1],[254,2,257,12],[264,0,265,1],[264,2,265,12],[256,13,257,29],[264,13,265,29],[244,0,245,29],[239,0,242,1],[239,2,242,12],[235,13,236,29],[215,13,216,29],[217,13,218,29],[219,13,220,29],[223,13,224,29],[227,13,228,29],[229,13,230,29],[207,0,208,1],[207,2,208,12],[209,0,216,1],[209,2,216,12],[225,13,226,29],[193,13,194,29],[197,13,198,29],[199,13,200,29],[201,13,202,29],[193,0,194,1],[193,2,194,12],[195,0,202,1],[195,2,202,12],[189,13,190,29],[177,30,178,30],[159,13,160,29],[161,13,162,29],[163,13,164,29],[165,13,166,29],[167,13,168,29],[169,13,170,29],[171,13,172,29],[173,13,174,29],[175,13,176,29],[165,30,166,30],[167,30,168,30],[169,30,170,30],[171,30,172,30],[173,30,174,30],[131,0,132,29],[126,13,127,29],[106,30,107,30],[108,30,109,30],[110,30,111,30],[106,13,107,29],[108,13,109,29],[110,13,111,29],[112,13,113,29],[116,13,117,29],[118,13,119,29],[120,13,121,29],[122,13,123,29],[124,13,125,29],[110,0,111,1],[110,2,111,12],[112,0,123,1],[112,2,123,12],[129,0,130,29],[129,30,130,30],[114,13,115,29],[124,0,127,1],[124,2,127,12],[106,0,109,1],[60,31,61,31],[112,30,113,30],[114,30,115,30],[116,30,117,30],[118,30,119,30],[120,30,121,30],[84,30,85,30],[86,30,87,30],[88,30,89,30],[90,30,91,30],[96,30,97,30],[98,30,99,30],[100,30,101,30],[102,30,103,30],[92,30,93,30],[94,30,95,30],[68,30,69,30],[70,30,71,30],[72,30,73,30],[60,30,61,30],[68,13,69,29],[70,13,71,29],[72,13,73,29],[74,13,75,29],[76,13,77,29],[78,13,79,29],[82,13,83,29],[84,13,85,29],[86,13,87,29],[88,13,89,29],[90,13,91,29],[92,13,93,29],[94,13,95,29],[96,13,97,29],[98,13,99,29],[100,13,101,29],[74,30,75,30],[76,30,77,30],[78,30,79,30],[80,30,81,30],[82,30,83,30],[80,0,81,29],[84,0,85,1],[84,2,85,12],[86,0,87,1],[86,2,87,12],[88,0,89,1],[88,2,89,12],[74,2,77,12],[78,0,79,1],[78,2,79,12],[82,0,83,1],[82,2,83,12],[62,13,63,29],[64,13,65,29],[66,13,67,29],[62,30,63,30],[64,30,65,30],[66,30,67,30],[1,0,2,29],[3,0,4,29],[1,30,2,30],[3,30,4,30],[58,0,59,29],[60,0,61,29],[41,0,46,1],[41,2,46,12],[41,13,42,29],[43,13,44,29],[45,13,46,29],[51,0,56,1],[51,2,56,12],[51,13,52,29],[53,13,54,29],[55,13,56,29],[51,30,52,30],[47,0,50,1],[244,30,245,30],[270,13,271,29],[258,13,259,29],[260,13,261,29],[262,13,263,29],[246,0,247,29],[246,30,247,30],[264,30,265,30],[266,30,267,30],[268,30,269,30],[248,0,249,1],[258,0,259,1],[258,2,259,12],[260,0,263,1],[260,2,263,12],[248,2,249,12],[250,0,251,1],[250,2,251,12],[252,0,253,1],[252,2,253,12],[268,13,269,29],[282,13,283,29],[278,13,279,29],[280,13,281,29],[272,13,273,29],[274,13,275,29],[276,13,277,29],[292,13,293,29],[280,30,281,30],[282,30,283,30],[286,30,287,30],[272,30,273,30],[274,30,275,30],[276,30,277,30],[278,30,279,30],[290,30,291,30],[296,30,297,30],[298,30,299,30],[300,30,301,30],[302,30,303,30],[133,0,134,1],[133,2,134,12],[135,0,138,1],[135,2,138,12],[139,0,144,1],[139,2,144,12],[179,30,180,30],[181,30,182,30],[183,30,184,30],[185,30,186,30],[187,30,188,30],[189,30,190,30],[199,30,200,30],[201,30,202,30],[135,13,136,29],[137,13,138,29],[157,13,158,29],[177,13,178,29],[195,13,196,29],[213,13,214,29],[246,31,247,31],[288,30,289,30],[248,30,249,30],[250,30,251,30],[252,30,253,30],[254,30,255,30],[256,30,257,30],[258,30,259,30],[260,30,261,30],[262,30,263,30],[149,31,150,31],[185,31,186,31],[203,31,204,31],[221,31,222,31],[237,31,238,31],[223,2,236,12],[237,0,238,29],[217,0,218,1],[217,2,218,12],[219,0,220,1],[219,2,220,12],[221,0,222,29],[161,0,164,1],[161,2,164,12],[165,0,168,1],[165,2,168,12],[169,0,174,1],[169,2,174,12],[175,30,176,30],[185,0,186,29],[187,0,190,1],[187,2,190,12],[191,0,192,1],[191,2,192,12],[139,13,140,29],[141,13,142,29],[143,13,144,29],[145,13,146,29],[147,13,148,29],[179,13,180,29],[181,13,182,29],[183,13,184,29],[187,13,188,29],[205,13,206,29],[207,13,208,29],[203,0,204,29],[205,0,206,1],[205,2,206,12],[209,13,210,29],[211,13,212,29],[145,0,146,1],[145,2,146,12],[147,0,148,1],[147,2,148,12],[151,13,152,29],[153,13,154,29],[155,13,156,29],[149,0,150,29],[151,0,154,1],[151,2,154,12],[155,0,160,1],[155,2,160,12],[175,0,182,1],[175,2,182,12],[183,0,184,1],[183,2,184,12],[191,13,192,29],[280,0,283,1],[280,2,283,12],[310,0,313,1],[328,0,331,1],[328,2,331,12],[266,31,267,31],[274,0,275,1],[274,2,275,12],[276,0,277,1],[276,2,277,12],[266,0,267,29],[268,0,269,1],[268,2,269,12],[270,0,271,1],[270,2,271,12],[270,30,271,30],[278,0,279,1],[278,2,279,12],[272,0,273,1],[272,2,273,12],[290,13,291,29],[288,31,289,31],[300,13,301,29],[302,13,303,29],[332,0,333,1],[332,2,333,12],[334,0,335,1],[334,2,335,12],[322,0,323,1],[322,2,323,12],[324,0,325,1],[324,2,325,12],[326,0,327,1],[326,2,327,12],[348,0,349,1],[348,2,349,12],[350,0,351,1],[350,2,351,12],[352,0,353,1],[352,2,353,12],[342,0,343,1],[342,2,343,12],[344,0,345,1],[344,2,345,12],[346,0,347,1],[346,2,347,12],[368,13,369,29],[368,30,369,30],[370,13,371,29],[370,30,371,30],[354,0,355,1],[354,2,355,12],[356,0,361,1],[356,2,361,12],[362,0,363,1],[362,2,363,12],[354,30,355,30],[356,13,357,29],[356,30,357,30],[358,13,359,29],[358,30,359,30],[360,13,361,29],[360,30,361,30],[362,13,363,29],[362,30,363,30],[352,13,353,29],[352,30,353,30],[354,13,355,29],[372,0,373,1],[372,2,373,12],[374,0,375,1],[374,2,375,12],[376,0,377,1],[376,2,377,12],[372,13,373,29],[372,30,373,30],[374,13,375,29],[374,30,375,30],[376,13,377,29],[376,30,377,30],[364,0,365,1],[364,2,365,12],[366,0,367,29],[368,0,369,1],[368,2,369,12],[370,0,371,1],[370,2,371,12],[364,13,365,29],[364,30,365,30],[342,13,343,29],[342,30,343,30],[344,13,345,29],[344,30,345,30],[346,13,347,29],[346,30,347,30],[348,13,349,29],[348,30,349,30],[350,13,351,29],[350,30,351,30],[378,13,379,29],[378,30,379,30],[380,13,381,29],[380,30,381,30],[382,13,383,29],[382,30,383,30],[336,30,337,30],[366,30,367,30],[320,31,321,31],[336,31,337,31],[366,31,367,31],[322,13,323,29],[324,13,325,29],[326,13,327,29],[328,13,329,29],[320,0,321,29],[378,0,379,1],[378,2,379,12],[380,0,383,1],[380,2,383,12],[338,13,339,29],[338,30,339,30],[340,13,341,29],[340,30,341,30]]}
[]
["Baccalauréat professionnel « maintenance des équipements industriels »  – Unité U 11",null,null,null,null,null,null,null,null,null,null,null,null,null,null,null,null,null,null,null,null,null,null,null,null,null,null,null,null,null,{"$f":"(AE4+AE26)","v":100}]
[]
["CP 2.1 Analyser le fonctionnement et l’organisation d’un système ",null,null,null,null,null,null,null,null,null,null,null,null,null,null,null,null,null,null,null,null,null,null,null,null,null,null,null,null,null,40,{"$f":"SUM(AE6:AE25)","v":100}]
[]
[1,null,"Décoder toutes formes de représentation.",null,null,null,null,null,null,null,null,null,null,"Les représentations sont lues et comprises sans erreur.",null,null,null,null,null,null,null,null,null,null,null,null,null,null,null,null,10]
[]
[2,null,"Décrire le système dans son environnement d’un point de vue fonctionnel, temporel et structurel :\n• Identifier les fonctions opératives.\n• Identifier la fonction :\n     - sécurité,\n     - dialogue (homme/machine) et surveillance,\n     - alimentation en énergie.\n• Décrire le rôle et les caractéristiques des composants réalisant ces fonctions.\n• Lire et décoder l’évolution temporelle du bien.\n• Décoder les modes de production et/ou l’exploitation du bien.\n",null,null,null,null,null,null,null,null,null,null,"La description à l’écrit ou à l’oral doit être conforme : \n          - au système,                                                               \n          - à son environnement,                                                 \n          - aux normes en vigueur.\n",null,null,null,null,null,null,null,null,null,null,null,null,null,null,null,null,5]
[]
[null,null,null,null,null,null,null,null,null,null,null,null,null,"Ce descriptif intègre toutes les fonctions opératives du système et leurs interactions.",null,null,null,null,null,null,null,null,null,null,null,null,null,null,null,null,5]
[]
[null,null,null,null,null,null,null,null,null,null,null,null,null,"Chaque fonction est repérée et délimitée sur les documents et sur le bien sans erreur.",null,null,null,null,null,null,null,null,null,null,null,null,null,null,null,null,15]
[]
[null,null,null,null,null,null,null,null,null,null,null,null,null,"Les composants qui participent à chaque fonction sont identifiés",null,null,null,null,null,null,null,null,null,null,null,null,null,null,null,null,15]
[]
[null,null,null,null,null,null,null,null,null,null,null,null,null,"La description à l’écrit ou à l’oral doit être conforme aux composants et à leurs fonctions.",null,null,null,null,null,null,null,null,null,null,null,null,null,null,null,null,10]
[]
[null,null,null,null,null,null,null,null,null,null,null,null,null,"L’évolution temporelle est assimilée et décrite.",null,null,null,null,null,null,null,null,null,null,null,null,null,null,null,null,5]
[]
[null,null,null,null,null,null,null,null,null,null,null,null,null,"Le fonctionnement est compris.",null,null,null,null,null,null,null,null,null,null,null,null,null,null,null,null,20]
[]
[3,null,"Analyser tout ou partie du bilan énergétique.",null,null,null,null,null,null,null,null,null,null,"Les causes des pertes sont identifiées. ",null,null,null,null,null,null,null,null,null,null,null,null,null,null,null,null,5]
[]
[null,null,null,null,null,null,null,null,null,null,null,null,null,"Les paramètres de puissance, de travail et de rendement sont identifiés et éventuellement calculés ou vérifiés.",null,null,null,null,null,null,null,null,null,null,null,null,null,null,null,null,10]
[]
["CP 2.2 Analyser les solutions mécaniques réalisant les fonctions opératives.",null,null,null,null,null,null,null,null,null,null,null,null,null,null,null,null,null,null,null,null,null,null,null,null,null,null,null,null,null,60,{"$f":"SUM(AE28:AE57)","v":100}]
[]
[1,null,"Décoder toutes formes de représentation des solutions constructives.",null,null,null,null,null,null,null,null,null,null,"Les plans, schémas, documents techniques, éclatés… sont lus et compris sans erreur.",null,null,null,null,null,null,null,null,null,null,null,null,null,null,null,null,10]
[]
[2,null,"Identifier, pour chaque solution technique    (assemblage, guidage, étanchéité, transmission,  transformation des mouvements…) :\n• les composants utilisés,\n• les performances attendues ou constatées,\n• les caractéristiques,\n• les conditions d’utilisations,\n• les risques de défaillances.\n",null,null,null,null,null,null,null,null,null,null,"Les composants constitutifs des solutions et leurs éléments d’assemblage sont identifiés et désignés exhaustivement et sans erreur.",null,null,null,null,null,null,null,null,null,null,null,null,null,null,null,null,6]
[]
[null,null,null,null,null,null,null,null,null,null,null,null,null,"Les caractéristiques, les performances, les conditions d’utilisations, les risques de défaillances sont explicités.",null,null,null,null,null,null,null,null,null,null,null,null,null,null,null,null,6]
[]
[null,null,null,null,null,null,null,null,null,null,null,null,null,"Les dérives de fonctionnement sont justifiées.",null,null,null,null,null,null,null,null,null,null,null,null,null,null,null,null,6]
[]
[3,null,"Décrire la cinématique des parties opératives.",null,null,null,null,null,null,null,null,null,null,"La description (schéma cinématique) doit être conforme :\n- aux solutions mécaniques,",null,null,null,null,null,null,null,null,null,null,null,null,null,null,null,null,5]
[]
[null,null,null,null,null,null,null,null,null,null,null,null,null,"La description (schéma cinématique) doit être conforme :\n- à son environnement,",null,null,null,null,null,null,null,null,null,null,null,null,null,null,null,null,5]
[]
[null,null,null,null,null,null,null,null,null,null,null,null,null,"La description (schéma cinématique) doit être conforme :\n- aux normes de représentation en vigueur.",null,null,null,null,null,null,null,null,null,null,null,null,null,null,null,null,5]
[]
[4,null,"Décrire et vérifier par le calcul des solutions constructives.",null,null,null,null,null,null,null,null,null,null,"La description est conforme à l’ensemble étudié",null,null,null,null,null,null,null,null,null,null,null,null,null,null,null,null,5]
[]
[null,null,null,null,null,null,null,null,null,null,null,null,null,"Les formules sont correctement utilisées.",null,null,null,null,null,null,null,null,null,null,null,null,null,null,null,null,10]
[]
[null,null,null,null,null,null,null,null,null,null,null,null,null,"Les logiciels de calcul et les résultats fournis sont correctement exploités.",null,null,null,null,null,null,null,null,null,null,null,null,null,null,null,null,10]
[]
[5,null,"Etablir des schémas et croquis des solutions techniques.",null,null,null,null,null,null,null,null,null,null,"Les schémas réalisés sont conformes aux solutions et respectent les  normes de représentation.",null,null,null,null,null,null,null,null,null,null,null,null,null,null,null,null,5]
[]
[null,null,null,null,null,null,null,null,null,null,null,null,null,"Les croquis sont exploitables.",null,null,null,null,null,null,null,null,null,null,null,null,null,null,null,null,10]
[]
[6,null,"Rédiger des consignes :\n- gammes de montage démontage,\n- procédures de réglages.\n",null,null,null,null,null,null,null,null,null,null,"Les gammes et les procédures sont exploitables et répondent au besoin.",null,null,null,null,null,null,null,null,null,null,null,null,null,null,null,null,10]
[]
[null,null,null,null,null,null,null,null,null,null,null,null,null,"Le plan de prévention est réactualisé.",null,null,null,null,null,null,null,null,null,null,null,null,null,null,null,null,2]
[]
[null,null,null,null,null,null,null,null,null,null,null,null,null,"Le langage utilisé est correct et approprié.",null,null,null,null,null,null,null,null,null,null,null,null,null,null,null,null,5]
[]
[]
["Baccalauréat professionnel « maintenance des équipements industriels »  – Unité U 2",null,null,null,null,null,null,null,null,null,null,null,null,null,null,null,null,null,null,null,null,null,null,null,null,null,null,null,null,null,{"$f":"AE61+AE81+AE105","v":100}]
[]
["CP 2.3 : Analyser les solutions de gestion, de distribution, de conversion des énergies pneumatique hydraulique et électrique.",null,null,null,null,null,null,null,null,null,null,null,null,null,null,null,null,null,null,null,null,null,null,null,null,null,null,null,null,null,40,{"$f":"SUM(AE63:AE80)","v":100}]
[]
[1,null,"Décoder toutes formes de représentation des circuits de distribution des énergies.",null,null,null,null,null,null,null,null,null,null,"Les représentations sont lues et comprises sans erreur.",null,null,null,null,null,null,null,null,null,null,null,null,null,null,null,null,12]
[]
[2,null,"Identifier les matériels qui concourent à assurer la protection des personnes et des biens.",null,null,null,null,null,null,null,null,null,null,"Les matériels qui concourent à assurer la protection des personnes et des biens sont localisés, reconnus et nommés.\nLe régime de neutre de l’installation est identifié.",null,null,null,null,null,null,null,null,null,null,null,null,null,null,null,null,12]
[]
[3,null,"Identifier et désigner pour chaque solution technique (gestion, traitement, distribution, protection, conversion) :\n• les composants utilisés,\n• les performances attendues ou constatées,\n• les caractéristiques,\n• les conditions d’utilisations,\n• les risques de défaillances",null,null,null,null,null,null,null,null,null,null,"Les composants constitutifs des solutions techniques et leurs éléments d’assemblage sont identifiés et désignés exhaustivement et sans erreur.",null,null,null,null,null,null,null,null,null,null,null,null,null,null,null,null,12]
[]
[null,null,null,null,null,null,null,null,null,null,null,null,null,"Les caractéristiques, les performances, les conditions d’utilisations, les risques de défaillances sont listés.",null,null,null,null,null,null,null,null,null,null,null,null,null,null,null,null,12]
[]
[null,null,null,null,null,null,null,null,null,null,null,null,null,"Les dérives de fonctionnement sont justifiées.",null,null,null,null,null,null,null,null,null,null,null,null,null,null,null,null,12]
[]
[null,null,null,null,null,null,null,null,null,null,null,null,null,"Les risques de défaillances sont listés et décrits.",null,null,null,null,null,null,null,null,null,null,null,null,null,null,null,null,10]
[]
[4,null,"Décrire d’un point de vue temporel :\n• l’évolution des niveaux d’énergie\n• les comportements des différents composants.\n",null,null,null,null,null,null,null,null,null,null,"Les outils descripteurs sont maîtrisés",null,null,null,null,null,null,null,null,null,null,null,null,null,null,null,null,10]
[]
[null,null,null,null,null,null,null,null,null,null,null,null,null,"La description temporelle représente fidèlement des paramètres des énergies et le fonctionnement des composants.",null,null,null,null,null,null,null,null,null,null,null,null,null,null,null,null,10]
[]
[5,null,"Décrire et valider par le calcul les niveaux d’énergie associés aux solutions techniques à assurer.",null,null,null,null,null,null,null,null,null,null,"Les paramètres (débit, pression, intensité…) sont vérifiés.",null,null,null,null,null,null,null,null,null,null,null,null,null,null,null,null,10]
[]
["CP 3.1 : Préparer son intervention.",null,null,null,null,null,null,null,null,null,null,null,null,null,null,null,null,null,null,null,null,null,null,null,null,null,null,null,null,null,30,{"$f":"SUM(AE83:AE104)","v":100}]
[]
[1,null,"Prendre connaissance de la demande d’intervention.",null,null,null,null,null,null,null,null,null,null,"Les indications portées sur la demande d’intervention et au plan de prévention sont identifiées et assimilées (comprises).",null,null,null,null,null,null,null,null,null,null,null,null,null,null,null,null,10]
[]
[2,null,"Collecter les documents nécessaires à l’intervention.",null,null,null,null,null,null,null,null,null,null,"Les documents collectés permettent d’organiser et de réaliser l’intervention.",null,null,null,null,null,null,null,null,null,null,null,null,null,null,null,null,10]
[]
[3,null,"Evaluer les difficultés d’accès aux composants",null,null,null,null,null,null,null,null,null,null,"Les contraintes d’accès sont repérées et énumérées.",null,null,null,null,null,null,null,null,null,null,null,null,null,null,null,null,10]
[]
[4,null,"Situer le ou les dispositifs de sécurité interne ou externe du bien.",null,null,null,null,null,null,null,null,null,null,"Les dispositifs de sécurités sont convenablement localisés.",null,null,null,null,null,null,null,null,null,null,null,null,null,null,null,null,10]
[]
[5,null,"Identifier les risques de son intervention",null,null,null,null,null,null,null,null,null,null,"Les risques sont bien repérés",null,null,null,null,null,null,null,null,null,null,null,null,null,null,null,null,10]
[]
[6,null,"Recenser les moyens de protections individuels et collectifs.",null,null,null,null,null,null,null,null,null,null,"Les moyens sont listés exhaustivement.",null,null,null,null,null,null,null,null,null,null,null,null,null,null,null,null,10]
[]
[7,null,"Formuler les modifications à apporter si nécessaire.",null,null,null,null,null,null,null,null,null,null,"Les nouvelles contraintes sont prises en compte.",null,null,null,null,null,null,null,null,null,null,null,null,null,null,null,null,8]
[]
[8,null,"Analyser ou établir la procédure de son intervention.",null,null,null,null,null,null,null,null,null,null,"La procédure est comprise  ou judicieusement rédigée.",null,null,null,null,null,null,null,null,null,null,null,null,null,null,null,null,8]
[]
[9,null,"Evaluer le temps nécessaire et le délai de livraison (mise à disposition après réparation).",null,null,null,null,null,null,null,null,null,null,"La durée de l’intervention prévue est adaptée.",null,null,null,null,null,null,null,null,null,null,null,null,null,null,null,null,8]
[]
[10,null,"Planifier son intervention en tenant compte :\n• des impératifs de production,\n• des stocks disponibles,\n• de la durée estimée de son intervention\n",null,null,null,null,null,null,null,null,null,null,"Tous les critères de planification sont respectés.",null,null,null,null,null,null,null,null,null,null,null,null,null,null,null,null,8]
[]
[11,null,"Rassembler et inventorier les outils, les appareils de mesures et de contrôles, les moyens de manutention et de sécurité nécessaires.",null,null,null,null,null,null,null,null,null,null,"L’ensemble des moyens est  identifié, vérifié et répertorié.",null,null,null,null,null,null,null,null,null,null,null,null,null,null,null,null,8]
[]
["CP 3.2 : Émettre des propositions d’améliorations d’un bien",null,null,null,null,null,null,null,null,null,null,null,null,null,null,null,null,null,null,null,null,null,null,null,null,null,null,null,null,null,30,{"$f":"SUM(AE107:AE128)","v":100}]
[]
[1,null,"Exploiter l’historique du bien.",null,null,null,null,null,null,null,null,null,null,"Les événements sont analysés.",null,null,null,null,null,null,null,null,null,null,null,null,null,null,null,null,10]
[]
[null,null,null,null,null,null,null,null,null,null,null,null,null,"Les données liés à la maintenabilité (fiabilité, accessibilité, temps d’intervention…) et à la sécurité, justifiant la proposition de modification, sont repérées.",null,null,null,null,null,null,null,null,null,null,null,null,null,null,null,null,10]
[]
[2,null,"Argumenter la proposition d’amélioration au regard des problèmes constatés (maintenabilité, sécurité).",null,null,null,null,null,null,null,null,null,null,"Les justifications orales et écrites sont exploitables et pertinentes.\nLa proposition est justifiée économiquement.",null,null,null,null,null,null,null,null,null,null,null,null,null,null,null,null,10]
[]
[3,null,"Proposer des solutions d’amélioration d’un point de vue maintenance sur :\n• la partie commande\n• la partie opérative\n• l’environnement\nExemple :\n une nouvelle solution constructive\n un composant de remplacement…\n",null,null,null,null,null,null,null,null,null,null,"La solution ou le composant proposé doit permettre d’améliorer la fiabilité,",null,null,null,null,null,null,null,null,null,null,null,null,null,null,null,null,10]
[]
[null,null,null,null,null,null,null,null,null,null,null,null,null,"La solution ou le composant proposé doit permettre de diminuer le temps d’intervention,",null,null,null,null,null,null,null,null,null,null,null,null,null,null,null,null,10]
[]
[null,null,null,null,null,null,null,null,null,null,null,null,null,"La solution ou le composant proposé doit permettre d’améliorer l’accessibilité,",null,null,null,null,null,null,null,null,null,null,null,null,null,null,null,null,10]
[]
[null,null,null,null,null,null,null,null,null,null,null,null,null,"La solution ou le composant proposé doit permettre de diminuer le coût des pièces de rechanges",null,null,null,null,null,null,null,null,null,null,null,null,null,null,null,null,8]
[]
[null,null,null,null,null,null,null,null,null,null,null,null,null,"La solution ou le composant proposé doit permettre d’améliorer la sécurité.",null,null,null,null,null,null,null,null,null,null,null,null,null,null,null,null,8]
[]
[null,null,null,null,null,null,null,null,null,null,null,null,null,"La sécurité est optimisée.",null,null,null,null,null,null,null,null,null,null,null,null,null,null,null,null,8]
[]
[4,null,"Produire des documents présentant l’évolution.",null,null,null,null,null,null,null,null,null,null,"Les documents produits sont exploitables et conformes aux normes en vigueur quand ils y font référence.",null,null,null,null,null,null,null,null,null,null,null,null,null,null,null,null,8]
[]
[null,null,null,null,null,null,null,null,null,null,null,null,null,"L’évolution du plan de prévention est proposée.",null,null,null,null,null,null,null,null,null,null,null,null,null,null,null,null,8]
[]
[]
["Baccalauréat professionnel « maintenance des équipements industriels »  – Unité U 31",null,null,null,null,null,null,null,null,null,null,null,null,null,null,null,null,null,null,null,null,null,null,null,null,null,null,null,null,null,{"$f":"(AE132+AE150+AE186+AE204+AE222+AE238)","v":100}]
[]
["CP 1.4 - Exécuter des opérations de surveillance et d’inspection",null,null,null,null,null,null,null,null,null,null,null,null,null,null,null,null,null,null,null,null,null,null,null,null,null,null,null,null,null,15,{"$f":"SUM(AE134:AE149)","v":100}]
[]
[1,null,"Mettre le bien dans les conditions requises pour effectuer les mesures, les contrôles et les surveillances.",null,null,null,null,null,null,null,null,null,null,"Le plan de prévention est compris et respecté",null,null,null,null,null,null,null,null,null,null,null,null,null,null,null,null,10]
[]
[2,null,"Surveiller un bien :\n• surveiller le fonctionnement en mobilisant les cinq sens,\n• vérifier les données de contrôle (indicateurs, voyants…), repérer les dérives.",null,null,null,null,null,null,null,null,null,null,"Les signes d’anomalies sont détectés.",null,null,null,null,null,null,null,null,null,null,null,null,null,null,null,null,15]
[]
[null,null,null,null,null,null,null,null,null,null,null,null,null,"Les données sont lues et les dérives détectées.",null,null,null,null,null,null,null,null,null,null,null,null,null,null,null,null,15]
[]
[3,null,"Effectuer les mesures et les contrôles :\n• localiser les points de contrôle sur le bien,\n• régler, calibrer les appareils ou matériels de contrôle,\n• collecter  et reporter les résultats des mesures et des contrôles.",null,null,null,null,null,null,null,null,null,null,"Les points de contrôle sont repérés sans erreurs.",null,null,null,null,null,null,null,null,null,null,null,null,null,null,null,null,16]
[]
[null,null,null,null,null,null,null,null,null,null,null,null,null,"Les calibres sont choisis et les réglages sont effectués correctement.",null,null,null,null,null,null,null,null,null,null,null,null,null,null,null,null,12]
[]
[null,null,null,null,null,null,null,null,null,null,null,null,null,"Les résultats des mesures et contrôles sont collectés et écrits sans erreurs.",null,null,null,null,null,null,null,null,null,null,null,null,null,null,null,null,12]
[]
[4,null,"Remettre le bien dans les conditions normales de fonctionnement.",null,null,null,null,null,null,null,null,null,null,"Le bien est dans les conditions normales de fonctionnement.",null,null,null,null,null,null,null,null,null,null,null,null,null,null,null,null,10]
[]
[5,null,"Saisir ou rédiger un compte-rendu d’intervention.",null,null,null,null,null,null,null,null,null,null,"Le compte-rendu, écrit ou saisi, est pertinent et exploitable.",null,null,null,null,null,null,null,null,null,null,null,null,null,null,null,null,10]
[]
["CP 1.5 - Exécuter les travaux d’amélioration ou de modification du bien",null,null,null,null,null,null,null,null,null,null,null,null,null,null,null,null,null,null,null,null,null,null,null,null,null,null,null,null,null,26,{"$f":"SUM(AE152:AE185)","v":100}]
[]
[1,null,"Préparer la zone d’intervention (bien et son environnement).",null,null,null,null,null,null,null,null,null,null,"La zone est libérée, nettoyée et sécurisée.",null,null,null,null,null,null,null,null,null,null,null,null,null,null,null,null,6]
[]
[null,null,null,null,null,null,null,null,null,null,null,null,null,"Les énergies sont repérées, le bien est consigné.",null,null,null,null,null,null,null,null,null,null,null,null,null,null,null,null,6]
[]
[2,null,"Effectuer la dépose de la partie du bien à modifier.",null,null,null,null,null,null,null,null,null,null,"Les composants sont repérés et déposés suivant un ordre logique.",null,null,null,null,null,null,null,null,null,null,null,null,null,null,null,null,9]
[]
[null,null,null,null,null,null,null,null,null,null,null,null,null,"Les composants à conserver ne sont pas endommagés.",null,null,null,null,null,null,null,null,null,null,null,null,null,null,null,null,8]
[]
[null,null,null,null,null,null,null,null,null,null,null,null,null,"Les éléments d’assemblage sont classés.",null,null,null,null,null,null,null,null,null,null,null,null,null,null,null,null,8]
[]
[3,null,"Réceptionner les travaux externalisés",null,null,null,null,null,null,null,null,null,null,"Les éléments reçus sont vérifiés : dimensions, nature des matériaux,",null,null,null,null,null,null,null,null,null,null,null,null,null,null,null,null,6]
[]
[null,null,null,null,null,null,null,null,null,null,null,null,null,"Les éléments reçus sont vérifiés : quantité, aspect, caractéristiques …",null,null,null,null,null,null,null,null,null,null,null,null,null,null,null,null,6]
[]
[4,null,"Installer les éléments de l’amélioration ou de la modification.",null,null,null,null,null,null,null,null,null,null,"Tous les composants sont assemblés et montés dans le respect des procédures et des notices techniques.",null,null,null,null,null,null,null,null,null,null,null,null,null,null,null,null,12]
[]
[null,null,null,null,null,null,null,null,null,null,null,null,null,"Les énergies sont raccordées.",null,null,null,null,null,null,null,null,null,null,null,null,null,null,null,null,11]
[]
[5,null,"Effectuer les tests et procéder à la mise au point(réglages, paramétrages…)",null,null,null,null,null,null,null,null,null,null,"Les paramétrages sont corrects  et respectent les procédures prédéfinies.",null,null,null,null,null,null,null,null,null,null,null,null,null,null,null,null,5]
[]
[null,null,null,null,null,null,null,null,null,null,null,null,null,"Les réglages sont effectués.",null,null,null,null,null,null,null,null,null,null,null,null,null,null,null,null,5]
[]
[null,null,null,null,null,null,null,null,null,null,null,null,null,"Le bien est prêt pour la mise en service.",null,null,null,null,null,null,null,null,null,null,null,null,null,null,null,null,4]
[]
[6,null,"Rétablir l’environnement du bien.",null,null,null,null,null,null,null,null,null,null,"L’environnement du bien est préparé et nettoyé.",null,null,null,null,null,null,null,null,null,null,null,null,null,null,null,null,2]
[]
[null,null,null,null,null,null,null,null,null,null,null,null,null,"Les outillages et les équipements sont rangés.",null,null,null,null,null,null,null,null,null,null,null,null,null,null,null,null,2]
[]
[null,null,null,null,null,null,null,null,null,null,null,null,null,"Les déchets sont éliminés.",null,null,null,null,null,null,null,null,null,null,null,null,null,null,null,null,2]
[]
[null,null,null,null,null,null,null,null,null,null,null,null,null,"Les pièces, les composants, les consommables sont classés ou réformés.",null,null,null,null,null,null,null,null,null,null,null,null,null,null,null,null,2]
[]
[7,null,"Mettre en service le bien avec l’exploitant (après déconsignation).",null,null,null,null,null,null,null,null,null,null,"Les performances attendues sont atteintes.",null,null,null,null,null,null,null,null,null,null,null,null,null,null,null,null,6]
[]
["CP 4.1 - Recevoir et transmettre des informations",null,null,null,null,null,null,null,null,null,null,null,null,null,null,null,null,null,null,null,null,null,null,null,null,null,null,null,null,null,12,{"$f":"SUM(AE188:AE203)","v":100}]
[]
[1,null,"Comprendre, s’approprier un ordre, une consigne, un constat de défaillance.\nQuestionner l’exploitation du bien afin de compléter les informations.\n",null,null,null,null,null,null,null,null,null,null,"Les paramètres, les éléments du message sont compris sans déformation et dans leur intégralit\n",null,null,null,null,null,null,null,null,null,null,null,null,null,null,null,null,25]
[]
[null,null,null,null,null,null,null,null,null,null,null,null,null,"Les questions posées sont pertinentes par rapport à la problématique à résoudre et les réponses retenues sont en adéquation avec le problème.\n",null,null,null,null,null,null,null,null,null,null,null,null,null,null,null,null,13]
[]
[2,null,"Extraire les éléments nécessaires à l’information au sein de la documentation disponible",null,null,null,null,null,null,null,null,null,null,"Le choix de la documentation retenue est judicieux et les informations collectées sont comprises et exploitées sans erreur.\n",null,null,null,null,null,null,null,null,null,null,null,null,null,null,null,null,12]
[]
[3,null,"Analyser les informations (ordre, consignes, constat) et  les éléments recueillis (documentation).",null,null,null,null,null,null,null,null,null,null,"La synthèse est cohérente avec la problématique.",null,null,null,null,null,null,null,null,null,null,null,null,null,null,null,null,25]
[]
[4,null,"Formuler oralement ou par écrit la synthèse de son analyse en utilisant les diverses formes de langages et de communication technique ou scientifique.",null,null,null,null,null,null,null,null,null,null,"A l’écrit, la formulation est claire, univoque. Elle utilise le langage le mieux adapté pour la compréhension du message.",null,null,null,null,null,null,null,null,null,null,null,null,null,null,null,null,7]
[]
[null,null,null,null,null,null,null,null,null,null,null,null,null,"Les désignations employées sont normalisées.",null,null,null,null,null,null,null,null,null,null,null,null,null,null,null,null,6]
[]
[null,null,null,null,null,null,null,null,null,null,null,null,null,"L’expression orale doit être structurée et le vocabulaire utilisé précis. Elle permet une compréhension sans équivoque du message à transmettre.",null,null,null,null,null,null,null,null,null,null,null,null,null,null,null,null,6]
[]
[null,null,null,null,null,null,null,null,null,null,null,null,null,"Le message transmis comporte les éléments essentiels.",null,null,null,null,null,null,null,null,null,null,null,null,null,null,null,null,6]
[]
["CP 4.2 - Rédiger et argumenter des comptes rendus.",null,null,null,null,null,null,null,null,null,null,null,null,null,null,null,null,null,null,null,null,null,null,null,null,null,null,null,null,null,12,{"$f":"SUM(AE206:AE221)","v":100}]
[]
[1,null,"Identifier les informations pertinentes relatives à la maintenance.",null,null,null,null,null,null,null,null,null,null,"Les informations pertinentes sont retenues.  ",null,null,null,null,null,null,null,null,null,null,null,null,null,null,null,null,15]
[]
[2,null,"Choisir les outils de descriptions les mieux adaptés au compte-rendu.",null,null,null,null,null,null,null,null,null,null,"Les documents pour rendre compte sont proposés avec pertinence (schémas, plans, procédures, dossiers technique et de maintenance",null,null,null,null,null,null,null,null,null,null,null,null,null,null,null,null,15]
[]
[3,null,"Rédiger et mettre en forme le compte-rendu.",null,null,null,null,null,null,null,null,null,null,"A l’écrit, la formulation est claire, univoque. Elle utilise le langage le mieux adapté pour la compréhension du compte-rendu",null,null,null,null,null,null,null,null,null,null,null,null,null,null,null,null,10]
[]
[null,null,null,null,null,null,null,null,null,null,null,null,null,"Les désignations employées sont normalisées",null,null,null,null,null,null,null,null,null,null,null,null,null,null,null,null,10]
[]
[null,null,null,null,null,null,null,null,null,null,null,null,null,"L’expression orale doit être structurée et le vocabulaire utilisé précis. Elle permet une compréhension sans équivoque du compte-rendu.",null,null,null,null,null,null,null,null,null,null,null,null,null,null,null,null,10]
[]
[null,null,null,null,null,null,null,null,null,null,null,null,null,"Le compte-rendu transmis comporte les éléments essentiels.",null,null,null,null,null,null,null,null,null,null,null,null,null,null,null,null,10]
[]
[4,null,"Proposer si nécessaire :\n• les éléments de mise à jour des documents : techniques, de sécurités, de procédures\n• tous documents, informations nécessaires à la bonne compréhension de l’intervention",null,null,null,null,null,null,null,null,null,null,"Les éléments proposés sont pertinents et utilisables.",null,null,null,null,null,null,null,null,null,null,null,null,null,null,null,null,15]
[]
[5,null,"Préciser éventuellement les difficultés rencontrées.",null,null,null,null,null,null,null,null,null,null,"L’écart entre le travail réalisé et le travail demandé est décrit et argumenté",null,null,null,null,null,null,null,null,null,null,null,null,null,null,null,null,15]
[]
["Exposer l'étude de cas",null,null,null,null,null,null,null,null,null,null,null,null,null,null,null,null,null,null,null,null,null,null,null,null,null,null,null,null,null,17,{"$f":"SUM(AE224:AE237)","v":100}]
[]
[1,null,"Exposer l’Etude de cas",null,null,null,null,null,null,null,null,null,null,"L’exposé traduit  sans équivoque le résultat des analyses relatées dans le rapport: la description de l’équipement",null,null,null,null,null,null,null,null,null,null,null,null,null,null,null,null,16]
[]
[null,null,null,null,null,null,null,null,null,null,null,null,null,"L’exposé traduit  sans équivoque le résultat des analyses relatées dans le rapport: énoncer de la problematique relative à la  maintenance",null,null,null,null,null,null,null,null,null,null,null,null,null,null,null,null,16]
[]
[null,null,null,null,null,null,null,null,null,null,null,null,null,"L’exposé traduit  sans équivoque le résultat des analyses relatées dans le rapport: la présentation de la solution retenue.",null,null,null,null,null,null,null,null,null,null,null,null,null,null,null,null,18]
[]
[null,null,null,null,null,null,null,null,null,null,null,null,null,"L’exposé traduit  sans équivoque la mise en œuvre des propositions techniques : la description des interventions réalisées,",null,null,null,null,null,null,null,null,null,null,null,null,null,null,null,null,17]
[]
[null,null,null,null,null,null,null,null,null,null,null,null,null,"L’exposé traduit  sans équivoque la mise en œuvre des propositions techniques : l’intégration des procédures de sécurité,",null,null,null,null,null,null,null,null,null,null,null,null,null,null,null,null,10]
[]
[null,null,null,null,null,null,null,null,null,null,null,null,null,"L’exposé traduit  sans équivoque la mise en œuvre des propositions techniques : l’intégration des procédures d’hygiène,",null,null,null,null,null,null,null,null,null,null,null,null,null,null,null,null,6]
[]
[null,null,null,null,null,null,null,null,null,null,null,null,null,"L’exposé traduit  sans équivoque la mise en œuvre des propositions techniques : la prise en compte de l’environnement.",null,null,null,null,null,null,null,null,null,null,null,null,null,null,null,null,17]
[]
["Donner des informations complémentaires",null,null,null,null,null,null,null,null,null,null,null,null,null,null,null,null,null,null,null,null,null,null,null,null,null,null,null,null,null,18,{"$f":"SUM(AE240:AE243)","v":100}]
[]
[2,null,"Donner des informations complémentaires.",null,null,null,null,null,null,null,null,null,null,"Les réponses aux membres de la commission d’évaluation permettent d’apporter des informations complémentaires,",null,null,null,null,null,null,null,null,null,null,null,null,null,null,null,null,50]
[]
[null,null,null,null,null,null,null,null,null,null,null,null,null,"Les réponses aux membres de la commission d’évaluation permettent d’argumenter les choix effectués.",null,null,null,null,null,null,null,null,null,null,null,null,null,null,null,null,50]
[]
[]
["Baccalauréat professionnel « maintenance des équipements industriels »  – Unité U 32",null,null,null,null,null,null,null,null,null,null,null,null,null,null,null,null,null,null,null,null,null,null,null,null,null,null,null,null,null,{"$f":"(AE247+AE267)","v":100}]
[]
["CP 1.3 - Réparer un composant",null,null,null,null,null,null,null,null,null,null,null,null,null,null,null,null,null,null,null,null,null,null,null,null,null,null,null,null,null,80,{"$f":"SUM(AE249:AE266)","v":100}]
[]
[1,null,"Etudier le démontage, analyser la gamme ou la réaliser si nécessaire.",null,null,null,null,null,null,null,null,null,null,"La stratégie est logique et permet un démontage sans détérioration.",null,null,null,null,null,null,null,null,null,null,null,null,null,null,null,null,14]
[]
[2,null,"Rassembler et vérifier les outillages et matériels nécessaires.",null,null,null,null,null,null,null,null,null,null,"Les moyens rassemblés sont en bon état et adaptés à l’intervention.",null,null,null,null,null,null,null,null,null,null,null,null,null,null,null,null,8]
[]
[3,null,"Effectuer le démontage",null,null,null,null,null,null,null,null,null,null,"Les moyens de manutention et l’outillage sont mis en œuvre correctement et en toute sécurité",null,null,null,null,null,null,null,null,null,null,null,null,null,null,null,null,15]
[]
[4,null,"Analyser l’état du composant.",null,null,null,null,null,null,null,null,null,null,"L’inspection du composant permet :\n- de définir les pièces à remplacer ou à retoucher.",null,null,null,null,null,null,null,null,null,null,null,null,null,null,null,null,8]
[]
[null,null,null,null,null,null,null,null,null,null,null,null,null,"L’inspection du composant permet :\n- d’évaluer le coût de la réparation et de décider de sa poursuite.",null,null,null,null,null,null,null,null,null,null,null,null,null,null,null,null,8]
[]
[5,null,"Vérifier la disponibilité des pièces de rechange, des consommables, et leurs correspondances avec le composant démonté.",null,null,null,null,null,null,null,null,null,null,"Les pièces de rechanges commandées ou sorties du magasin sont conformes.",null,null,null,null,null,null,null,null,null,null,null,null,null,null,null,null,12]
[]
[6,null,"Remonter le composant avec les pièces de rechange, le régler.",null,null,null,null,null,null,null,null,null,null,"Le remontage est réalisé dans le respect des procédures.",null,null,null,null,null,null,null,null,null,null,null,null,null,null,null,null,15]
[]
[null,null,null,null,null,null,null,null,null,null,null,null,null,"Les réglages et essais nécessaires sont correctement réalisés.",null,null,null,null,null,null,null,null,null,null,null,null,null,null,null,null,10]
[]
[7,null,"Vérifier le bon fonctionnement du composant.",null,null,null,null,null,null,null,null,null,null,"La réparation réalisée est conforme aux exigences de fonctionnement du composant",null,null,null,null,null,null,null,null,null,null,null,null,null,null,null,null,10]
[]
["CP 1.7 - Identifier les risques, définir et mettre en œuvre les mesures de prévention adaptées : \névaluations des risques autres qu’électriques\n",null,null,null,null,null,null,null,null,null,null,null,null,null,null,null,null,null,null,null,null,null,null,null,null,null,null,null,null,null,20,{"$f":"SUM(AE269:AE284)","v":100}]
[]
[1,null,"Identifier les phénomènes dangereux et les situations dangereuses",null,null,null,null,null,null,null,null,null,null,"Les phénomènes dangereux et les situations dangereuses liés au bien, à son environnement et à l’activité sont identifiés.",null,null,null,null,null,null,null,null,null,null,null,null,null,null,null,null,15]
[]
[2,null,"Déterminer les mesures de prévention en regard des situations dangereuses identifiées dans l’acte de maintenance",null,null,null,null,null,null,null,null,null,null,"Les mesures de prévention définies sont adaptées aux situations dangereuses identifiées",null,null,null,null,null,null,null,null,null,null,null,null,null,null,null,null,15]
[]
[3,null,"Mettre en œuvre les E.P.I.",null,null,null,null,null,null,null,null,null,null,"La mise en œuvre des E.P.I. est correcte.",null,null,null,null,null,null,null,null,null,null,null,null,null,null,null,null,15]
[]
[4,null,"Mettre en œuvre les E.P.C.",null,null,null,null,null,null,null,null,null,null,"La mise en œuvre des E.P.C. est correcte.",null,null,null,null,null,null,null,null,null,null,null,null,null,null,null,null,15]
[]
[5,null,"Utiliser des équipements individuels de sécurité (EIS)",null,null,null,null,null,null,null,null,null,null,"La mise en œuvre des E.I.S. est correcte.",null,null,null,null,null,null,null,null,null,null,null,null,null,null,null,null,10]
[]
[6,null,"Consigner (énergie, accés…)\nRespecter les procédures",null,null,null,null,null,null,null,null,null,null,"Les procédures de mise en œuvre des équipements et des outillages sont conformes",null,null,null,null,null,null,null,null,null,null,null,null,null,null,null,null,20]
[]
[7,null,"Proposer des modifications au plan de prévention.",null,null,null,null,null,null,null,null,null,null,"Les propositions permettent:\n- de se prémunir de situations ou de phénomènes dangereux résiduels identifiés.",null,null,null,null,null,null,null,null,null,null,null,null,null,null,null,null,5]
[]
[null,null,null,null,null,null,null,null,null,null,null,null,null,"Les propositions permettent:\n- d’améliorer les mesures de prévention préconisées.",null,null,null,null,null,null,null,null,null,null,null,null,null,null,null,null,5]
[]
[]
[]
["Baccalauréat professionnel « maintenance des équipements industriels »  – Unité U 33",null,null,null,null,null,null,null,null,null,null,null,null,null,null,null,null,null,null,null,null,null,null,null,null,null,null,null,null,null,{"$f":"(AE289+AE321+AE337+AE367)","v":100}]
[]
["CP 1.1 - Diagnostiquer les pannes",null,null,null,null,null,null,null,null,null,null,null,null,null,null,null,null,null,null,null,null,null,null,null,null,null,null,null,null,null,40,{"$f":"SUM(AE291:AE320)","v":100}]
[]
[1,null,"Etablir le constat de défaillance.",null,null,null,null,null,null,null,null,null,null,"Les évènements avant panne sont collectés ",null,null,null,null,null,null,null,null,null,null,null,null,null,null,null,null,10]
[]
[null,null,null,null,null,null,null,null,null,null,null,null,null,"Les informations délivrées par le système sont relevées.",null,null,null,null,null,null,null,null,null,null,null,null,null,null,null,null,10]
[]
[null,null,null,null,null,null,null,null,null,null,null,null,null,"La configuration du bien en panne est  analysée",null,null,null,null,null,null,null,null,null,null,null,null,null,null,null,null,10]
[]
[2,null,"Identifier la fonction défaillante ",null,null,null,null,null,null,null,null,null,null,"La fonction défaillante est repérée",null,null,null,null,null,null,null,null,null,null,null,null,null,null,null,null,10]
[]
[3,null,"Localiser la panne :\n\n• identifier et lister les composants susceptibles d’être défaillants,\n\n• hiérarchiser les hypothèses,\n\n• effectuer les tests, mesures et contrôles permettant de valider ou non les hypothèses.",null,null,null,null,null,null,null,null,null,null,"Les composants sont listés exhaustivement",null,null,null,null,null,null,null,null,null,null,null,null,null,null,null,null,10]
[]
[null,null,null,null,null,null,null,null,null,null,null,null,null,"Les hypothèses sont pertinentes, plausibles et correctement hiérarchisées.",null,null,null,null,null,null,null,null,null,null,null,null,null,null,null,null,5]
[]
[null,null,null,null,null,null,null,null,null,null,null,null,null,"Les points de test et de contrôle sont bien choisis et localisés.",null,null,null,null,null,null,null,null,null,null,null,null,null,null,null,null,5]
[]
[null,null,null,null,null,null,null,null,null,null,null,null,null,"Les appareils de mesure et de contrôle sont correctement mis en œuvre.",null,null,null,null,null,null,null,null,null,null,null,null,null,null,null,null,5]
[]
[null,null,null,null,null,null,null,null,null,null,null,null,null,"Les résultats sont bien interprétés.",null,null,null,null,null,null,null,null,null,null,null,null,null,null,null,null,5]
[]
[null,null,null,null,null,null,null,null,null,null,null,null,null,"La chronologie des tests est adaptée en fonction des résultats des contrôles précédents.",null,null,null,null,null,null,null,null,null,null,null,null,null,null,null,null,5]
[]
[4,null,"Identifier le composant défectueux.",null,null,null,null,null,null,null,null,null,null,"L’identification du composant est correcte.",null,null,null,null,null,null,null,null,null,null,null,null,null,null,null,null,10]
[]
[null,null,null,null,null,null,null,null,null,null,null,null,null,"La durée de la localisation est optimale.",null,null,null,null,null,null,null,null,null,null,null,null,null,null,null,null,3]
[]
[5,null,"Expertiser le composant et identifier la cause de la panne.",null,null,null,null,null,null,null,null,null,null,"La cause de la panne est plausible",null,null,null,null,null,null,null,null,null,null,null,null,null,null,null,null,5]
[]
[null,null,null,null,null,null,null,null,null,null,null,null,null,"La demande complémentaire d’expertise du bien est justifiée.",null,null,null,null,null,null,null,null,null,null,null,null,null,null,null,null,3]
[]
[null,null,null,null,null,null,null,null,null,null,null,null,null,"La durée du diagnostic est optimale",null,null,null,null,null,null,null,null,null,null,null,null,null,null,null,null,4]
[]
["CP 1.2 - Remettre en état de fonctionnement un bien",null,null,null,null,null,null,null,null,null,null,null,null,null,null,null,null,null,null,null,null,null,null,null,null,null,null,null,null,null,20,{"$f":"SUM(AE323:AE336)","v":100}]
[]
[1,null,"Situer le composant défectueux sur le bien.",null,null,null,null,null,null,null,null,null,null,"Le composant est repéré rapidement sur le bien",null,null,null,null,null,null,null,null,null,null,null,null,null,null,null,null,20]
[]
[2,null,"Rassembler et vérifier les outillages et matériels nécessaires.",null,null,null,null,null,null,null,null,null,null,"Les moyens rassemblés sont en bon état et adaptés à l’intervention.",null,null,null,null,null,null,null,null,null,null,null,null,null,null,null,null,10]
[]
[3,null,"Consigner tout ou partie du bien.",null,null,null,null,null,null,null,null,null,null,"Le bien est consigné dans le respect de la réglementation et des procédures.",null,null,null,null,null,null,null,null,null,null,null,null,null,null,null,null,15]
[]
[4,null,"Effectuer la dépose du composant défectueux.",null,null,null,null,null,null,null,null,null,null,"Les consignes et procédures sont respectées.",null,null,null,null,null,null,null,null,null,null,null,null,null,null,null,null,15]
[]
[null,null,null,null,null,null,null,null,null,null,null,null,null,"Les moyens de manutention et l’outillage sont mis en œuvre correctement et en toute sécurité.",null,null,null,null,null,null,null,null,null,null,null,null,null,null,null,null,15]
[]
[5,null,"Installer et régler le composant de remplacement.",null,null,null,null,null,null,null,null,null,null,"Le composant est remplacé sans risque pour les personnes et le bien.",null,null,null,null,null,null,null,null,null,null,null,null,null,null,null,null,15]
[]
[6,null,"Mettre en service le bien.",null,null,null,null,null,null,null,null,null,null,"Les performances du bien sont conformes au cahier des charges",null,null,null,null,null,null,null,null,null,null,null,null,null,null,null,null,10]
[]
["CP 1.6 - Mettre en service un bien dans le respect des procédures",null,null,null,null,null,null,null,null,null,null,null,null,null,null,null,null,null,null,null,null,null,null,null,null,null,null,null,null,null,20,{"$f":"SUM(AE339:AE366)","v":100}]
[]
[1,null,"Préparer le bien pour une mise en service.",null,null,null,null,null,null,null,null,null,null,"Les zones d’actions des effecteurs et la zone de travail sont propres et dégagées.",null,null,null,null,null,null,null,null,null,null,null,null,null,null,null,null,5]
[]
[null,null,null,null,null,null,null,null,null,null,null,null,null,"La vérification des scellements et la géométrie des biens sont réalisées.",null,null,null,null,null,null,null,null,null,null,null,null,null,null,null,null,5]
[]
[2,null,"S’informer sur le régime du neutre installé",null,null,null,null,null,null,null,null,null,null,"Le régime du neutre est identifié.",null,null,null,null,null,null,null,null,null,null,null,null,null,null,null,null,5]
[]
[3,null,"Vérifier les mises à la terre.",null,null,null,null,null,null,null,null,null,null,"Les mises à la terre sont  vérifiées.",null,null,null,null,null,null,null,null,null,null,null,null,null,null,null,null,5]
[]
[4,null,"Déconsigner tout ou partie du bien.",null,null,null,null,null,null,null,null,null,null,"Les procédures de déconsignation sont respectées",null,null,null,null,null,null,null,null,null,null,null,null,null,null,null,null,10]
[]
[5,null,"Vérifier la présence et les niveaux des énergies d’alimentation.",null,null,null,null,null,null,null,null,null,null,"La présence et les niveaux des énergies sont identifiés et conformes au cahier des charges.",null,null,null,null,null,null,null,null,null,null,null,null,null,null,null,null,5]
[]
[6,null,"S’approprier les différentes procédures de mise en service et de sécurité.",null,null,null,null,null,null,null,null,null,null,"Les descriptifs des différents modes de marche et d’arrêt, le document unique d’évaluation des risques et le plan de prévention sont lus et interprétés sans erreur.",null,null,null,null,null,null,null,null,null,null,null,null,null,null,null,null,5]
[]
[7,null,"Vérifier l’efficacité de la chaîne de sécurité",null,null,null,null,null,null,null,null,null,null,"Les arrêts d’urgence et les éléments de sécurité sont vérifiés et efficaces.",null,null,null,null,null,null,null,null,null,null,null,null,null,null,null,null,12]
[]
[8,null,"Participer à la mise en œuvre des procédures de préparation.",null,null,null,null,null,null,null,null,null,null,"Le bien est approvisionné dans ses différentes matières d’œuvre, les effecteurs sont prêts à opérer.",null,null,null,null,null,null,null,null,null,null,null,null,null,null,null,null,5]
[]
[9,null,"\nMettre le bien en position initiale.\n\nDémarrer ou participer au démarrage du bien.\n\n",null,null,null,null,null,null,null,null,null,null,"Le bien est mis en position initiale en toute sécurité.",null,null,null,null,null,null,null,null,null,null,null,null,null,null,null,null,5]
[]
[null,null,null,null,null,null,null,null,null,null,null,null,null,"Le bien fonctionne.",null,null,null,null,null,null,null,null,null,null,null,null,null,null,null,null,15]
[]
[null,null,null,null,null,null,null,null,null,null,null,null,null,"Les performances du bien et la matière d’œuvre sortante ou le    service sont vérifiés et conformes au cahier des charges.",null,null,null,null,null,null,null,null,null,null,null,null,null,null,null,null,5]
[]
[10,null,"Vérifier le bon fonctionnement des différents modes de marche et d’arrêt.",null,null,null,null,null,null,null,null,null,null,"Les différents modes de marche et d’arrêt sont vérifiés",null,null,null,null,null,null,null,null,null,null,null,null,null,null,null,null,13]
[]
[11,null,"Transmettre éventuellement les nouvelles consignes à l’utilisateur et lui remettre le bien",null,null,null,null,null,null,null,null,null,null,"Les nouvelles consignes sont transmises sans équivoque et le bien est remis à l’utilisateur.",null,null,null,null,null,null,null,null,null,null,null,null,null,null,null,null,5]
[]
["CP 1.7 - Identifier les risques, définir et mettre en œuvre les mesures de prévention adaptées",null,null,null,null,null,null,null,null,null,null,null,null,null,null,null,null,null,null,null,null,null,null,null,null,null,null,null,null,null,20,{"$f":"SUM(AE369:AE384)","v":100}]
[]
[1,null,"Identifier les phénomènes dangereux et les situations dangereuses ",null,null,null,null,null,null,null,null,null,null,"Les phénomènes dangereux et les situations dangereuses liés au bien, à son environnement et à l’activité sont identifiés.",null,null,null,null,null,null,null,null,null,null,null,null,null,null,null,null,15]
[]
[2,null,"Déterminer les mesures de prévention en regard des situations dangereuses identifiées dans l’acte de maintenance",null,null,null,null,null,null,null,null,null,null,"Les mesures de prévention définies sont adaptées aux situations dangereuses identifiées",null,null,null,null,null,null,null,null,null,null,null,null,null,null,null,null,15]
[]
[3,null,"Mettre en œuvre les E.P.I.",null,null,null,null,null,null,null,null,null,null,"La mise en œuvre des E.P.I. est correcte.",null,null,null,null,null,null,null,null,null,null,null,null,null,null,null,null,15]
[]
[4,null,"Mettre en œuvre les E.P.C.",null,null,null,null,null,null,null,null,null,null,"La mise en œuvre des E.P.C. est correcte.",null,null,null,null,null,null,null,null,null,null,null,null,null,null,null,null,15]
[]
[5,null,"Utiliser des équipements individuels de sécurité (EIS)",null,null,null,null,null,null,null,null,null,null,"La mise en œuvre des E.I.S. est correcte.",null,null,null,null,null,null,null,null,null,null,null,null,null,null,null,null,10]
[]
[6,null,"Consigner (energie,accés…)\nRespecter les procédures",null,null,null,null,null,null,null,null,null,null,"Les procédures de mise en œuvre des équipements et des outillages sont conformes",null,null,null,null,null,null,null,null,null,null,null,null,null,null,null,null,20]
[]
[7,null,"Proposer des modifications au plan de prévention.",null,null,null,null,null,null,null,null,null,null,"Les propositions permettent:\n- de se prémunir de situations ou de phénomènes dangereux résiduels identifiés.",null,null,null,null,null,null,null,null,null,null,null,null,null,null,null,null,5]
[]
[null,null,null,null,null,null,null,null,null,null,null,null,null,"Les propositions permettent:\n- d’améliorer les mesures de prévention préconisées.",null,null,null,null,null,null,null,null,null,null,null,null,null,null,null,null,5]

{"sheet":"Situations","index":2,"n_rows":68,"n_cols":2,"rows_kept":68,"cut":false,"hidden":false,"merged":[[0,11,0,12],[65,0,66,0],[65,1,66,12],[67,0,68,0],[67,1,68,12],[14,0,15,0],[14,1,15,12],[16,0,17,0],[16,1,17,12],[48,0,49,0],[48,1,49,12],[61,0,62,0],[61,1,62,12],[63,0,64,0],[63,1,64,12],[55,0,56,0],[55,1,56,12],[57,0,58,0],[57,1,58,12],[59,0,60,0],[59,1,60,12],[52,0,52,12],[53,0,54,0],[1,0,1,12],[2,0,3,0],[2,1,3,12],[4,0,5,0],[4,1,5,12],[6,0,7,0],[6,1,7,12],[8,0,9,0],[8,1,9,12],[53,1,54,12],[10,1,11,12],[12,0,13,0],[50,0,51,0],[50,1,51,12],[46,0,47,0],[46,1,47,12],[12,1,13,12],[10,0,11,0],[44,1,45,12],[35,0,35,12],[36,0,37,0],[36,1,37,12],[38,0,39,0],[38,1,39,12],[40,0,41,0],[40,1,41,12],[42,0,43,0],[42,1,43,12],[44,0,45,0],[18,0,18,12],[19,0,20,0],[19,1,20,12],[21,0,22,0],[21,1,22,12],[23,0,24,0],[23,1,24,12],[31,0,32,0],[31,1,32,12],[33,0,34,0],[33,1,34,12],[25,0,26,0],[25,1,26,12],[27,0,28,0],[27,1,28,12],[29,0,30,0],[29,1,30,12]]}
["Double-cliquer pour créer vos situations"]
["Situations d'évaluation U 11"]
["U11_A",{"$f":"IF(U11_A!$A$11=\"\",\"\",U11_A!$A$11)","v":""}]
[]
["U11_B",{"$f":"IF(U11_B!$A$11=\"\",\"\",U11_B!$A$11)","v":""}]
[]
["U11_C",{"$f":"IF(U11_C!$A$11=\"\",\"\",U11_C!$A$11)","v":""}]
[]
["U11_D",{"$f":"IF(U11_D!$A$11=\"\",\"\",U11_D!$A$11)","v":""}]
[]
["U11_E",{"$f":"IF(U11_E!$A$11=\"\",\"\",U11_E!$A$11)","v":""}]
[]
["U11_F",{"$f":"IF(U11_F!$A$11=\"\",\"\",U11_F!$A$11)","v":""}]
[]
["U11_G",{"$f":"IF(U11_G!$A$11=\"\",\"\",U11_G!$A$11)","v":""}]
[]
["U11_H",{"$f":"IF(U11_H!$A$11=\"\",\"\",U11_H!$A$11)","v":""}]
[]
["Situations d'évaluation U 2"]
["U2_A",{"$f":"IF(U2_A!$A$11=\"\",\"\",U2_A!$A$11)","v":""}]
[]
["U2_B",{"$f":"IF(U2_B!$A$11=\"\",\"\",U2_B!$A$11)","v":""}]
[]
["U2_C",{"$f":"IF(U2_C!$A$11=\"\",\"\",U2_C!$A$11)","v":""}]
[]
["U2_D",{"$f":"IF(U2_D!$A$11=\"\",\"\",U2_D!$A$11)","v":""}]
[]
["U2_E",{"$f":"IF(U2_E!$A$11=\"\",\"\",U2_E!$A$11)","v":""}]
[]
["U2_F",{"$f":"IF(U2_F!$A$11=\"\",\"\",U2_F!$A$11)","v":""}]
[]
["U2_G",{"$f":"IF(U2_G!$A$11=\"\",\"\",U2_G!$A$11)","v":""}]
[]
["U2_H",{"$f":"IF(U2_H!$A$11=\"\",\"\",U2_H!$A$11)","v":""}]
[]
["Situations d'évaluation U 32"]
["U32_A",{"$f":"IF(U32_A!$A$11=\"\",\"\",U32_A!$A$11)","v":""}]
[]
["U32_B",{"$f":"IF(U32_B!$A$11=\"\",\"\",U32_B!$A$11)","v":""}]
[]
["U32_C",{"$f":"IF(U32_C!$A$11=\"\",\"\",U32_C!$A$11)","v":""}]
[]
["U32_D",{"$f":"IF(U32_D!$A$11=\"\",\"\",U32_D!$A$11)","v":""}]
[]
["U32_E",{"$f":"IF(U32_E!$A$11=\"\",\"\",U32_E!$A$11)","v":""}]
[]
["U32_F",{"$f":"IF(U32_F!$A$11=\"\",\"\",U32_F!$A$11)","v":""}]
[]
["U32_G",{"$f":"IF(U32_G!$A$11=\"\",\"\",U32_G!$A$11)","v":""}]
[]
["U32_H",{"$f":"IF(U32_H!$A$11=\"\",\"\",U32_H!$A$11)","v":""}]
[]
["Sitations d'évaluation U 33"]
["U33_A",{"$f":"IF(U33_A!$A$11=\"\",\"\",U33_A!$A$11)","v":""}]
[]
["U33_B",{"$f":"IF(U33_B!$A$11=\"\",\"\",U33_B!$A$11)","v":""}]
[]
["U33_C",{"$f":"IF(U33_C!$A$11=\"\",\"\",U33_C!$A$11)","v":""}]
[]
["U33_D",{"$f":"IF(U33_D!$A$11=\"\",\"\",U33_D!$A$11)","v":""}]
[]
["U33_E",{"$f":"IF(U33_E!$A$11=\"\",\"\",U33_E!$A$11)","v":""}]
[]
["U33_F",{"$f":"IF(U33_F!$A$11=\"\",\"\",U33_F!$A$11)","v":""}]
[]
["U33_G",{"$f":"IF(U33_G!$A$11=\"\",\"\",U33_G!$A$11)","v":""}]
[]
["U33_H",{"$f":"IF(U33_H!$A$11=\"\",\"\",U33_H!$A$11)","v":""}]

{"sheet":"Bilan","index":3,"n_rows":35,"n_cols":21,"rows_kept":35,"cut":false,"hidden":false,"merged":[[34,2,34,10],[2,11,2,15],[2,2,2,10],[3,2,3,3],[3,7,3,8],[3,9,3,10],[3,4,3,5]]}
[]
["Session",null,null,null,null,null,null,null,null,null,null,null,null,null,null,null,3,4,2,3,3]
["Lycée",null,"Accès fiches (Double cliquer sans modifier les écritures)",null,null,null,null,null,null,null,null,"/20",null,null,null,null,"coef 3","coef 4","coef 2","coef 3","coef 3"]
["N°","Noms & Prénoms","U11",null,"U2",null,"U31","U32",null,"U33",null,"U11","U2","U31","U32","U33","U11","U2","U31","U32","U33"]
[1,null,"U11_01",null,"U2_01",null,"U31_01","U32_01",null,"U33_01",null,null,null,null,null,null,{"$f":"IF(L5=\"\",\"\",L5*$Q$2)","v":""},{"$f":"IF(M5=\"\",\"\",M5*$R$2)","v":""},{"$f":"IF(N5=\"\",\"\",N5*$S$2)","v":""},{"$f":"IF(O5=\"\",\"\",O5*$T$2)","v":""},{"$f":"IF(P5=\"\",\"\",P5*$U$2)","v":""}]
[2,null,"U11_02",null,"U2_02",null,"U31_02","U32_02",null,"U33_02",null,null,null,null,null,null,{"$f":"IF(L6=\"\",\"\",L6*$Q$2)","v":""},{"$f":"IF(M6=\"\",\"\",M6*$R$2)","v":""},{"$f":"IF(N6=\"\",\"\",N6*$S$2)","v":""},{"$f":"IF(O6=\"\",\"\",O6*$T$2)","v":""},{"$f":"IF(P6=\"\",\"\",P6*$U$2)","v":""}]
[3,null,"U11_03",null,"U2_03",null,"U31_03","U32_03",null,"U33_03",null,null,null,null,null,null,"","","","",""]
[4,null,"U11_04",null,"U2_04",null,"U31_04","U32_04",null,"U33_04",null,null,null,null,null,null,"","","","",""]
[5,null,"U11_05",null,"U2_05",null,"U31_05","U32_05",null,"U33_05",null,null,null,null,null,null,"","","","",""]
[6,null,"U11_06",null,"U2_06",null,"U31_06","U32_06",null,"U33_06",null,null,null,null,null,null,"","","","",""]
[7,null,"U11_07",null,"U2_07",null,"U31_07","U32_07",null,"U33_07",null,null,null,null,null,null,"","","","",""]
[8,null,"U11_08",null,"U2_08",null,"U31_08","U32_08",null,"U33_08",null,null,null,null,null,null,"","","","",""]
[9,null,"U11_09",null,"U2_09",null,"U31_09","U32_09",null,"U33_09",null,null,null,null,null,null,"","","","",""]
[10,null,"U11_10",null,"U2_10",null,"U31_10","U32_10",null,"U33_10",null,null,null,null,null,null,"","","","",""]
[11,null,"U11_11",null,"U2_11",null,"U31_11","U32_11",null,"U33_11",null,null,null,null,null,null,"","","","",""]
[12,null,"U11_12",null,"U2_12",null,"U31_12","U32_12",null,"U33_12",null,null,null,null,null,null,"","","","",""]
[13,null,"U11_13",null,"U2_13",null,"U31_13","U32_13",null,"U33_13",null,null,null,null,null,null,"","","","",""]
[14,null,"U11_14",null,"U2_14",null,"U31_14","U32_14",null,"U33_14",null,null,null,null,null,null,"","","","",""]
[15,null,"U11_15",null,"U2_15",null,"U31_15","U32_15",null,"U33_15",null,null,null,null,null,null,"","","","",""]
[16,null,"U11_16",null,"U2_16",null,"U31_16","U32_16",null,"U33_16",null,null,null,null,null,null,"","","","",""]
[17,null,"U11_17",null,"U2_17",null,"U31_17","U32_17",null,"U33_17",null,null,null,null,null,null,"","","","",""]
[18,null,"U11_18",null,"U2_18",null,"U31_18","U32_18",null,"U33_18",null,null,null,null,null,null,"","","","",""]
[19,null,"U11_19",null,"U2_19",null,"U31_19","U32_19",null,"U33_19",null,null,null,null,null,null,"","","","",""]
[20,null,"U11_20",null,"U2_20",null,"U31_20","U32_20",null,"U33_20",null,null,null,null,null,null,"","","","",""]
[21,null,"U11_21",null,"U2_21",null,"U31_21","U32_21",null,"U33_21",null,null,null,null,null,null,"","","","",""]
[22,null,"U11_22",null,"U2_22",null,"U31_22","U32_22",null,"U33_22",null,null,null,null,null,null,"","","","",""]
[23,null,"U11_23",null,"U2_23",null,"U31_23","U32_23",null,"U33_23",null,null,null,null,null,null,"","","","",""]
[24,null,"U11_24",null,"U2_24",null,"U31_24","U32_24",null,"U33_24",null,null,null,null,null,null,"","","","",""]
[25,null,"U11_25",null,"U2_25",null,"U31_25","U32_25",null,"U33_25",null,null,null,null,null,null,"","","","",""]
[26,null,"U11_26",null,"U2_26",null,"U31_26","U32_26",null,"U33_26",null,null,null,null,null,null,"","","","",""]
[27,null,"U11_27",null,"U2_27",null,"U31_27","U32_27",null,"U33_27",null,null,null,null,null,null,"","","","",""]
[28,null,"U11_28",null,"U2_28",null,"U31_28","U32_28",null,"U33_28",null,null,null,null,null,null,"","","","",""]
[29,null,"U11_29",null,"U2_29",null,"U31_29","U32_29",null,"U33_29",null,null,null,null,null,null,"","","","",""]
[30,null,"U11_30",null,"U2_30",null,"U31_30","U32_30",null,"U33_30",null,null,null,null,null,null,"","","","",""]
[null,null,"Moyenne",null,null,null,null,null,null,null,null,{"$f":"IF(SUM(L5:L34)=0,\"\",AVERAGE(L5:L34))","v":""},{"$f":"IF(SUM(M5:M34)=0,\"\",AVERAGE(M5:M34))","v":""},{"$f":"IF(SUM(N5:N34)=0,\"\",AVERAGE(N5:N34))","v":""},{"$f":"IF(SUM(O5:O34)=0,\"\",AVERAGE(O5:O34))","v":""},{"$f":"IF(SUM(P5:P34)=0,\"\",AVERAGE(P5:P34))","v":""}]

{"sheet":"U11","index":4,"n_rows":103,"n_cols":48,"rows_kept":103,"cut":false,"hidden":true,"merged":[[45,38,55,45],[70,38,87,45],[86,13,87,33],[86,34,87,37],[60,2,65,12],[66,2,71,12],[72,2,77,12],[78,2,81,12],[82,2,87,12],[68,34,69,37],[70,13,71,33],[70,34,71,37],[56,0,57,29],[56,30,57,33],[82,0,87,1],[78,0,81,1],[72,0,77,1],[66,0,71,1],[60,0,65,1],[78,13,79,33],[78,34,79,37],[80,13,81,33],[80,34,81,37],[82,13,83,33],[82,34,83,37],[84,13,85,33],[84,34,85,37],[72,13,73,33],[72,34,73,37],[74,13,75,33],[74,34,75,37],[76,13,77,33],[76,34,77,37],[64,13,65,33],[64,34,65,37],[66,13,67,33],[66,34,67,37],[68,13,69,33],[56,47,57,49],[58,13,59,33],[58,34,59,37],[60,13,61,33],[60,34,61,37],[62,13,63,33],[62,34,63,37],[58,0,59,1],[58,2,59,12],[5,47,5,48],[6,47,7,48],[89,4,91,39],[92,4,94,33],[92,34,94,39],[52,13,53,33],[52,34,53,37],[54,13,55,33],[54,34,55,37],[44,13,45,33],[44,34,45,37],[48,13,49,33],[48,34,49,37],[36,13,37,33],[36,34,37,37],[38,13,39,33],[38,34,39,37],[40,13,41,33],[40,34,41,37],[34,0,35,29],[34,30,35,33],[34,47,35,49],[32,0,33,33],[32,34,33,37],[32,38,32,45],[33,38,33,45],[42,13,43,33],[42,34,43,37],[26,0,26,45],[28,0,28,45],[29,0,29,45],[30,0,31,34],[30,35,30,39],[30,40,30,42],[30,43,30,45],[31,35,31,39],[31,40,31,42],[31,43,31,45],[36,0,37,1],[36,2,37,12],[15,1,15,22],[15,24,15,45],[24,1,24,2],[25,1,25,2],[24,3,24,45],[25,3,25,45],[22,0,22,45],[23,1,23,2],[23,3,23,45],[19,1,19,22],[19,24,19,45],[20,1,20,22],[20,24,20,45],[0,0,0,45],[1,0,1,45],[2,0,2,22],[2,23,2,29],[2,30,2,45],[3,0,5,22],[3,23,3,29],[3,30,4,45],[4,23,4,29],[5,23,5,29],[5,30,5,45],[6,0,6,45],[7,0,7,45],[8,0,8,45],[9,0,9,45],[10,0,10,45],[38,2,51,12],[38,0,51,1],[52,2,55,12],[52,0,55,1],[46,34,47,37],[50,34,51,37],[46,13,47,33],[16,1,16,22],[16,24,16,45],[17,1,17,22],[17,24,17,45],[18,1,18,22],[18,24,18,45],[50,13,51,33],[12,0,12,45],[13,1,13,22],[13,24,13,45],[14,1,14,22],[14,24,14,45]]}
["Baccalauréat professionnel « maintenance des équipements industriels »"]
["Épreuve E11 (Unité U11) : ANALYSE ET EXPLOITATION DE DONNEES TECHNIQUES"]
["Établissement : (tampon)",null,null,null,null,null,null,null,null,null,null,null,null,null,null,null,null,null,null,null,null,null,null,"Session : ",null,null,null,null,null,null,{"$f":"IF(Bilan!B2=\"\",\"\",Bilan!B2)","v":""}]
[{"$f":"IF(Bilan!B3=\"\",\"\",Bilan!B3)","v":""},null,null,null,null,null,null,null,null,null,null,null,null,null,null,null,null,null,null,null,null,null,null,"Nom du candidat:",null,null,null,null,null,null,{"$f":"IF(INDEX((Bilan!B5:B34),(MATCH(RIGHT(CELL(\"nomfichier\",A1),LEN(CELL(\"nomfichier\",A1))-FIND(\"]\",CELL(\"nomfichier\",A1))),Bilan!C5:C34,0)))=\"\",\"\",INDEX((Bilan!B5:B34),(MATCH(RIGHT(CELL(\"nomfichier\",A1),LEN(CELL(\"nomfichier\",A1))-FIND(\"]\",CELL(\"nomfichier\",A1))),Bilan!C5:C34,0))))","v":{"$error":"#N/A"}}]
[null,null,null,null,null,null,null,null,null,null,null,null,null,null,null,null,null,null,null,null,null,null,null,"Prénom : "]
[null,null,null,null,null,null,null,null,null,null,null,null,null,null,null,null,null,null,null,null,null,null,null,"Date de l'évaluation:",null,null,null,null,null,null,null,null,null,null,null,null,null,null,null,null,null,null,null,null,null,null,null,"Choisisser votre situation"]
["Lieu d’évaluation :"]
["      Etablissement"]
["      Entreprise :       "]
["Description sommaire du travail demandé :"]
[{"$f":"IF($AV$7=\"\",\"\",IF($AV$7=\"A\",IF(U11_A!A11=\"\",\"\",U11_A!A11),IF($AV$7=\"B\",IF(U11_B!A11=\"\",\"\",U11_B!A11),IF($AV$7=\"C\",IF(U11_C!A11=\"\",\"\",U11_C!A11),IF($AV$7=\"D\",IF(U11_D!A11=\"\",\"\",U11_D!A11),IF($AV$7=\"E\",IF(U11_E!A11=\"\",\"\",U11_E!A11),IF($AV$7=\"F\",IF(U11_F!A11=\"\",\"\",U11_F!A11),IF($AV$7=\"G\",IF(U11_G!A11=\"\",\"\",U11_G!A11),IF($AV$7=\"H\",IF(U11_H!A11=\"\",\"\",U11_H!A11),\"\")))))))))","v":""},{"$f":"IF($AV$7=\"\",\"\",IF($AV$7=\"A\",IF(U11_A!B11=\"\",\"\",U11_A!B11),IF($AV$7=\"B\",IF(U11_B!B11=\"\",\"\",U11_B!B11),IF($AV$7=\"C\",IF(U11_C!B11=\"\",\"\",U11_C!B11),IF($AV$7=\"D\",IF(U11_D!B11=\"\",\"\",U11_D!B11),IF($AV$7=\"E\",IF(U11_E!B11=\"\",\"\",U11_E!B11),IF($AV$7=\"F\",IF(U11_F!B11=\"\",\"\",U11_F!B11),IF($AV$7=\"G\",IF(U11_G!B11=\"\",\"\",U11_G!B11),IF($AV$7=\"H\",IF(U11_H!B11=\"\",\"\",U11_H!B11),\"\")))))))))","v":""},{"$f":"IF($AV$7=\"\",\"\",IF($AV$7=\"A\",IF(U11_A!C11=\"\",\"\",U11_A!C11),IF($AV$7=\"B\",IF(U11_B!C11=\"\",\"\",U11_B!C11),IF($AV$7=\"C\",IF(U11_C!C11=\"\",\"\",U11_C!C11),IF($AV$7=\"D\",IF(U11_D!C11=\"\",\"\",U11_D!C11),IF($AV$7=\"E\",IF(U11_E!C11=\"\",\"\",U11_E!C11),IF($AV$7=\"F\",IF(U11_F!C11=\"\",\"\",U11_F!C11),IF($AV$7=\"G\",IF(U11_G!C11=\"\",\"\",U11_G!C11),IF($AV$7=\"H\",IF(U11_H!C11=\"\",\"\",U11_H!C11),\"\")))))))))","v":""},{"$f":"IF($AV$7=\"\",\"\",IF($AV$7=\"A\",IF(U11_A!D11=\"\",\"\",U11_A!D11),IF($AV$7=\"B\",IF(U11_B!D11=\"\",\"\",U11_B!D11),IF($AV$7=\"C\",IF(U11_C!D11=\"\",\"\",U11_C!D11),IF($AV$7=\"D\",IF(U11_D!D11=\"\",\"\",U11_D!D11),IF($AV$7=\"E\",IF(U11_E!D11=\"\",\"\",U11_E!D11),IF($AV$7=\"F\",IF(U11_F!D11=\"\",\"\",U11_F!D11),IF($AV$7=\"G\",IF(U11_G!D11=\"\",\"\",U11_G!D11),IF($AV$7=\"H\",IF(U11_H!D11=\"\",\"\",U11_H!D11),\"\")))))))))","v":""},{"$f":"IF($AV$7=\"\",\"\",IF($AV$7=\"A\",IF(U11_A!E11=\"\",\"\",U11_A!E11),IF($AV$7=\"B\",IF(U11_B!E11=\"\",\"\",U11_B!E11),IF($AV$7=\"C\",IF(U11_C!E11=\"\",\"\",U11_C!E11),IF($AV$7=\"D\",IF(U11_D!E11=\"\",\"\",U11_D!E11),IF($AV$7=\"E\",IF(U11_E!E11=\"\",\"\",U11_E!E11),IF($AV$7=\"F\",IF(U11_F!E11=\"\",\"\",U11_F!E11),IF($AV$7=\"G\",IF(U11_G!E11=\"\",\"\",U11_G!E11),IF($AV$7=\"H\",IF(U11_H!E11=\"\",\"\",U11_H!E11),\"\")))))))))","v":""},{"$f":"IF($AV$7=\"\",\"\",IF($AV$7=\"A\",IF(U11_A!F11=\"\",\"\",U11_A!F11),IF($AV$7=\"B\",IF(U11_B!F11=\"\",\"\",U11_B!F11),IF($AV$7=\"C\",IF(U11_C!F11=\"\",\"\",U11_C!F11),IF($AV$7=\"D\",IF(U11_D!F11=\"\",\"\",U11_D!F11),IF($AV$7=\"E\",IF(U11_E!F11=\"\",\"\",U11_E!F11),IF($AV$7=\"F\",IF(U11_F!F11=\"\",\"\",U11_F!F11),IF($AV$7=\"G\",IF(U11_G!F11=\"\",\"\",U11_G!F11),IF($AV$7=\"H\",IF(U11_H!F11=\"\",\"\",U11_H!F11),\"\")))))))))","v":""},{"$f":"IF($AV$7=\"\",\"\",IF($AV$7=\"A\",IF(U11_A!G11=\"\",\"\",U11_A!G11),IF($AV$7=\"B\",IF(U11_B!G11=\"\",\"\",U11_B!G11),IF($AV$7=\"C\",IF(U11_C!G11=\"\",\"\",U11_C!G11),IF($AV$7=\"D\",IF(U11_D!G11=\"\",\"\",U11_D!G11),IF($AV$7=\"E\",IF(U11_E!G11=\"\",\"\",U11_E!G11),IF($AV$7=\"F\",IF(U11_F!G11=\"\",\"\",U11_F!G11),IF($AV$7=\"G\",IF(U11_G!G11=\"\",\"\",U11_G!G11),IF($AV$7=\"H\",IF(U11_H!G11=\"\",\"\",U11_H!G11),\"\")))))))))","v":""},{"$f":"IF($AV$7=\"\",\"\",IF($AV$7=\"A\",IF(U11_A!H11=\"\",\"\",U11_A!H11),IF($AV$7=\"B\",IF(U11_B!H11=\"\",\"\",U11_B!H11),IF($AV$7=\"C\",IF(U11_C!H11=\"\",\"\",U11_C!H11),IF($AV$7=\"D\",IF(U11_D!H11=\"\",\"\",U11_D!H11),IF($AV$7=\"E\",IF(U11_E!H11=\"\",\"\",U11_E!H11),IF($AV$7=\"F\",IF(U11_F!H11=\"\",\"\",U11_F!H11),IF($AV$7=\"G\",IF(U11_G!H11=\"\",\"\",U11_G!H11),IF($AV$7=\"H\",IF(U11_H!H11=\"\",\"\",U11_H!H11),\"\")))))))))","v":""},{"$f":"IF($AV$7=\"\",\"\",IF($AV$7=\"A\",IF(U11_A!I11=\"\",\"\",U11_A!I11),IF($AV$7=\"B\",IF(U11_B!I11=\"\",\"\",U11_B!I11),IF($AV$7=\"C\",IF(U11_C!I11=\"\",\"\",U11_C!I11),IF($AV$7=\"D\",IF(U11_D!I11=\"\",\"\",U11_D!I11),IF($AV$7=\"E\",IF(U11_E!I11=\"\",\"\",U11_E!I11),IF($AV$7=\"F\",IF(U11_F!I11=\"\",\"\",U11_F!I11),IF($AV$7=\"G\",IF(U11_G!I11=\"\",\"\",U11_G!I11),IF($AV$7=\"H\",IF(U11_H!I11=\"\",\"\",U11_H!I11),\"\")))))))))","v":""},{"$f":"IF($AV$7=\"\",\"\",IF($AV$7=\"A\",IF(U11_A!J11=\"\",\"\",U11_A!J11),IF($AV$7=\"B\",IF(U11_B!J11=\"\",\"\",U11_B!J11),IF($AV$7=\"C\",IF(U11_C!J11=\"\",\"\",U11_C!J11),IF($AV$7=\"D\",IF(U11_D!J11=\"\",\"\",U11_D!J11),IF($AV$7=\"E\",IF(U11_E!J11=\"\",\"\",U11_E!J11),IF($AV$7=\"F\",IF(U11_F!J11=\"\",\"\",U11_F!J11),IF($AV$7=\"G\",IF(U11_G!J11=\"\",\"\",U11_G!J11),IF($AV$7=\"H\",IF(U11_H!J11=\"\",\"\",U11_H!J11),\"\")))))))))","v":""},{"$f":"IF($AV$7=\"\",\"\",IF($AV$7=\"A\",IF(U11_A!K11=\"\",\"\",U11_A!K11),IF($AV$7=\"B\",IF(U11_B!K11=\"\",\"\",U11_B!K11),IF($AV$7=\"C\",IF(U11_C!K11=\"\",\"\",U11_C!K11),IF($AV$7=\"D\",IF(U11_D!K11=\"\",\"\",U11_D!K11),IF($AV$7=\"E\",IF(U11_E!K11=\"\",\"\",U11_E!K11),IF($AV$7=\"F\",IF(U11_F!K11=\"\",\"\",U11_F!K11),IF($AV$7=\"G\",IF(U11_G!K11=\"\",\"\",U11_G!K11),IF($AV$7=\"H\",IF(U11_H!K11=\"\",\"\",U11_H!K11),\"\")))))))))","v":""},{"$f":"IF($AV$7=\"\",\"\",IF($AV$7=\"A\",IF(U11_A!L11=\"\",\"\",U11_A!L11),IF($AV$7=\"B\",IF(U11_B!L11=\"\",\"\",U11_B!L11),IF($AV$7=\"C\",IF(U11_C!L11=\"\",\"\",U11_C!L11),IF($AV$7=\"D\",IF(U11_D!L11=\"\",\"\",U11_D!L11),IF($AV$7=\"E\",IF(U11_E!L11=\"\",\"\",U11_E!L11),IF($AV$7=\"F\",IF(U11_F!L11=\"\",\"\",U11_F!L11),IF($AV$7=\"G\",IF(U11_G!L11=\"\",\"\",U11_G!L11),IF($AV$7=\"H\",IF(U11_H!L11=\"\",\"\",U11_H!L11),\"\")))))))))","v":""},{"$f":"IF($AV$7=\"\",\"\",IF($AV$7=\"A\",IF(U11_A!M11=\"\",\"\",U11_A!M11),IF($AV$7=\"B\",IF(U11_B!M11=\"\",\"\",U11_B!M11),IF($AV$7=\"C\",IF(U11_C!M11=\"\",\"\",U11_C!M11),IF($AV$7=\"D\",IF(U11_D!M11=\"\",\"\",U11_D!M11),IF($AV$7=\"E\",IF(U11_E!M11=\"\",\"\",U11_E!M11),IF($AV$7=\"F\",IF(U11_F!M11=\"\",\"\",U11_F!M11),IF($AV$7=\"G\",IF(U11_G!M11=\"\",\"\",U11_G!M11),IF($AV$7=\"H\",IF(U11_H!M11=\"\",\"\",U11_H!M11),\"\")))))))))","v":""},{"$f":"IF($AV$7=\"\",\"\",IF($AV$7=\"A\",IF(U11_A!N11=\"\",\"\",U11_A!N11),IF($AV$7=\"B\",IF(U11_B!N11=\"\",\"\",U11_B!N11),IF($AV$7=\"C\",IF(U11_C!N11=\"\",\"\",U11_C!N11),IF($AV$7=\"D\",IF(U11_D!N11=\"\",\"\",U11_D!N11),IF($AV$7=\"E\",IF(U11_E!N11=\"\",\"\",U11_E!N11),IF($AV$7=\"F\",IF(U11_F!N11=\"\",\"\",U11_F!N11),IF($AV$7=\"G\",IF(U11_G!N11=\"\",\"\",U11_G!N11),IF($AV$7=\"H\",IF(U11_H!N11=\"\",\"\",U11_H!N11),\"\")))))))))","v":""},{"$f":"IF($AV$7=\"\",\"\",IF($AV$7=\"A\",IF(U11_A!O11=\"\",\"\",U11_A!O11),IF($AV$7=\"B\",IF(U11_B!O11=\"\",\"\",U11_B!O11),IF($AV$7=\"C\",IF(U11_C!O11=\"\",\"\",U11_C!O11),IF($AV$7=\"D\",IF(U11_D!O11=\"\",\"\",U11_D!O11),IF($AV$7=\"E\",IF(U11_E!O11=\"\",\"\",U11_E!O11),IF($AV$7=\"F\",IF(U11_F!O11=\"\",\"\",U11_F!O11),IF($AV$7=\"G\",IF(U11_G!O11=\"\",\"\",U11_G!O11),IF($AV$7=\"H\",IF(U11_H!O11=\"\",\"\",U11_H!O11),\"\")))))))))","v":""},{"$f":"IF($AV$7=\"\",\"\",IF($AV$7=\"A\",IF(U11_A!P11=\"\",\"\",U11_A!P11),IF($AV$7=\"B\",IF(U11_B!P11=\"\",\"\",U11_B!P11),IF($AV$7=\"C\",IF(U11_C!P11=\"\",\"\",U11_C!P11),IF($AV$7=\"D\",IF(U11_D!P11=\"\",\"\",U11_D!P11),IF($AV$7=\"E\",IF(U11_E!P11=\"\",\"\",U11_E!P11),IF($AV$7=\"F\",IF(U11_F!P11=\"\",\"\",U11_F!P11),IF($AV$7=\"G\",IF(U11_G!P11=\"\",\"\",U11_G!P11),IF($AV$7=\"H\",IF(U11_H!P11=\"\",\"\",U11_H!P11),\"\")))))))))","v":""},{"$f":"IF($AV$7=\"\",\"\",IF($AV$7=\"A\",IF(U11_A!Q11=\"\",\"\",U11_A!Q11),IF($AV$7=\"B\",IF(U11_B!Q11=\"\",\"\",U11_B!Q11),IF($AV$7=\"C\",IF(U11_C!Q11=\"\",\"\",U11_C!Q11),IF($AV$7=\"D\",IF(U11_D!Q11=\"\",\"\",U11_D!Q11),IF($AV$7=\"E\",IF(U11_E!Q11=\"\",\"\",U11_E!Q11),IF($AV$7=\"F\",IF(U11_F!Q11=\"\",\"\",U11_F!Q11),IF($AV$7=\"G\",IF(U11_G!Q11=\"\",\"\",U11_G!Q11),IF($AV$7=\"H\",IF(U11_H!Q11=\"\",\"\",U11_H!Q11),\"\")))))))))","v":""},{"$f":"IF($AV$7=\"\",\"\",IF($AV$7=\"A\",IF(U11_A!R11=\"\",\"\",U11_A!R11),IF($AV$7=\"B\",IF(U11_B!R11=\"\",\"\",U11_B!R11),IF($AV$7=\"C\",IF(U11_C!R11=\"\",\"\",U11_C!R11),IF($AV$7=\"D\",IF(U11_D!R11=\"\",\"\",U11_D!R11),IF($AV$7=\"E\",IF(U11_E!R11=\"\",\"\",U11_E!R11),IF($AV$7=\"F\",IF(U11_F!R11=\"\",\"\",U11_F!R11),IF($AV$7=\"G\",IF(U11_G!R11=\"\",\"\",U11_G!R11),IF($AV$7=\"H\",IF(U11_H!R11=\"\",\"\",U11_H!R11),\"\")))))))))","v":""},{"$f":"IF($AV$7=\"\",\"\",IF($AV$7=\"A\",IF(U11_A!S11=\"\",\"\",U11_A!S11),IF($AV$7=\"B\",IF(U11_B!S11=\"\",\"\",U11_B!S11),IF($AV$7=\"C\",IF(U11_C!S11=\"\",\"\",U11_C!S11),IF($AV$7=\"D\",IF(U11_D!S11=\"\",\"\",U11_D!S11),IF($AV$7=\"E\",IF(U11_E!S11=\"\",\"\",U11_E!S11),IF($AV$7=\"F\",IF(U11_F!S11=\"\",\"\",U11_F!S11),IF($AV$7=\"G\",IF(U11_G!S11=\"\",\"\",U11_G!S11),IF($AV$7=\"H\",IF(U11_H!S11=\"\",\"\",U11_H!S11),\"\")))))))))","v":""},{"$f":"IF($AV$7=\"\",\"\",IF($AV$7=\"A\",IF(U11_A!T11=\"\",\"\",U11_A!T11),IF($AV$7=\"B\",IF(U11_B!T11=\"\",\"\",U11_B!T11),IF($AV$7=\"C\",IF(U11_C!T11=\"\",\"\",U11_C!T11),IF($AV$7=\"D\",IF(U11_D!T11=\"\",\"\",U11_D!T11),IF($AV$7=\"E\",IF(U11_E!T11=\"\",\"\",U11_E!T11),IF($AV$7=\"F\",IF(U11_F!T11=\"\",\"\",U11_F!T11),IF($AV$7=\"G\",IF(U11_G!T11=\"\",\"\",U11_G!T11),IF($AV$7=\"H\",IF(U11_H!T11=\"\",\"\",U11_H!T11),\"\")))))))))","v":""},{"$f":"IF($AV$7=\"\",\"\",IF($AV$7=\"A\",IF(U11_A!U11=\"\",\"\",U11_A!U11),IF($AV$7=\"B\",IF(U11_B!U11=\"\",\"\",U11_B!U11),IF($AV$7=\"C\",IF(U11_C!U11=\"\",\"\",U11_C!U11),IF($AV$7=\"D\",IF(U11_D!U11=\"\",\"\",U11_D!U11),IF($AV$7=\"E\",IF(U11_E!U11=\"\",\"\",U11_E!U11),IF($AV$7=\"F\",IF(U11_F!U11=\"\",\"\",U11_F!U11),IF($AV$7=\"G\",IF(U11_G!U11=\"\",\"\",U11_G!U11),IF($AV$7=\"H\",IF(U11_H!U11=\"\",\"\",U11_H!U11),\"\")))))))))","v":""},{"$f":"IF($AV$7=\"\",\"\",IF($AV$7=\"A\",IF(U11_A!V11=\"\",\"\",U11_A!V11),IF($AV$7=\"B\",IF(U11_B!V11=\"\",\"\",U11_B!V11),IF($AV$7=\"C\",IF(U11_C!V11=\"\",\"\",U11_C!V11),IF($AV$7=\"D\",IF(U11_D!V11=\"\",\"\",U11_D!V11),IF($AV$7=\"E\",IF(U11_E!V11=\"\",\"\",U11_E!V11),IF($AV$7=\"F\",IF(U11_F!V11=\"\",\"\",U11_F!V11),IF($AV$7=\"G\",IF(U11_G!V11=\"\",\"\",U11_G!V11),IF($AV$7=\"H\",IF(U11_H!V11=\"\",\"\",U11_H!V11),\"\")))))))))","v":""},{"$f":"IF($AV$7=\"\",\"\",IF($AV$7=\"A\",IF(U11_A!W11=\"\",\"\",U11_A!W11),IF($AV$7=\"B\",IF(U11_B!W11=\"\",\"\",U11_B!W11),IF($AV$7=\"C\",IF(U11_C!W11=\"\",\"\",U11_C!W11),IF($AV$7=\"D\",IF(U11_D!W11=\"\",\"\",U11_D!W11),IF($AV$7=\"E\",IF(U11_E!W11=\"\",\"\",U11_E!W11),IF($AV$7=\"F\",IF(U11_F!W11=\"\",\"\",U11_F!W11),IF($AV$7=\"G\",IF(U11_G!W11=\"\",\"\",U11_G!W11),IF($AV$7=\"H\",IF(U11_H!W11=\"\",\"\",U11_H!W11),\"\")))))))))","v":""},{"$f":"IF($AV$7=\"\",\"\",IF($AV$7=\"A\",IF(U11_A!X11=\"\",\"\",U11_A!X11),IF($AV$7=\"B\",IF(U11_B!X11=\"\",\"\",U11_B!X11),IF($AV$7=\"C\",IF(U11_C!X11=\"\",\"\",U11_C!X11),IF($AV$7=\"D\",IF(U11_D!X11=\"\",\"\",U11_D!X11),IF($AV$7=\"E\",IF(U11_E!X11=\"\",\"\",U11_E!X11),IF($AV$7=\"F\",IF(U11_F!X11=\"\",\"\",U11_F!X11),IF($AV$7=\"G\",IF(U11_G!X11=\"\",\"\",U11_G!X11),IF($AV$7=\"H\",IF(U11_H!X11=\"\",\"\",U11_H!X11),\"\")))))))))","v":""},{"$f":"IF($AV$7=\"\",\"\",IF($AV$7=\"A\",IF(U11_A!Y11=\"\",\"\",U11_A!Y11),IF($AV$7=\"B\",IF(U11_B!Y11=\"\",\"\",U11_B!Y11),IF($AV$7=\"C\",IF(U11_C!Y11=\"\",\"\",U11_C!Y11),IF($AV$7=\"D\",IF(U11_D!Y11=\"\",\"\",U11_D!Y11),IF($AV$7=\"E\",IF(U11_E!Y11=\"\",\"\",U11_E!Y11),IF($AV$7=\"F\",IF(U11_F!Y11=\"\",\"\",U11_F!Y11),IF($AV$7=\"G\",IF(U11_G!Y11=\"\",\"\",U11_G!Y11),IF($AV$7=\"H\",IF(U11_H!Y11=\"\",\"\",U11_H!Y11),\"\")))))))))","v":""},{"$f":"IF($AV$7=\"\",\"\",IF($AV$7=\"A\",IF(U11_A!Z11=\"\",\"\",U11_A!Z11),IF($AV$7=\"B\",IF(U11_B!Z11=\"\",\"\",U11_B!Z11),IF($AV$7=\"C\",IF(U11_C!Z11=\"\",\"\",U11_C!Z11),IF($AV$7=\"D\",IF(U11_D!Z11=\"\",\"\",U11_D!Z11),IF($AV$7=\"E\",IF(U11_E!Z11=\"\",\"\",U11_E!Z11),IF($AV$7=\"F\",IF(U11_F!Z11=\"\",\"\",U11_F!Z11),IF($AV$7=\"G\",IF(U11_G!Z11=\"\",\"\",U11_G!Z11),IF($AV$7=\"H\",IF(U11_H!Z11=\"\",\"\",U11_H!Z11),\"\")))))))))","v":""},{"$f":"IF($AV$7=\"\",\"\",IF($AV$7=\"A\",IF(U11_A!AA11=\"\",\"\",U11_A!AA11),IF($AV$7=\"B\",IF(U11_B!AA11=\"\",\"\",U11_B!AA11),IF($AV$7=\"C\",IF(U11_C!AA11=\"\",\"\",U11_C!AA11),IF($AV$7=\"D\",IF(U11_D!AA11=\"\",\"\",U11_D!AA11),IF($AV$7=\"E\",IF(U11_E!AA11=\"\",\"\",U11_E!AA11),IF($AV$7=\"F\",IF(U11_F!AA11=\"\",\"\",U11_F!AA11),IF($AV$7=\"G\",IF(U11_G!AA11=\"\",\"\",U11_G!AA11),IF($AV$7=\"H\",IF(U11_H!AA11=\"\",\"\",U11_H!AA11),\"\")))))))))","v":""},{"$f":"IF($AV$7=\"\",\"\",IF($AV$7=\"A\",IF(U11_A!AB11=\"\",\"\",U11_A!AB11),IF($AV$7=\"B\",IF(U11_B!AB11=\"\",\"\",U11_B!AB11),IF($AV$7=\"C\",IF(U11_C!AB11=\"\",\"\",U11_C!AB11),IF($AV$7=\"D\",IF(U11_D!AB11=\"\",\"\",U11_D!AB11),IF($AV$7=\"E\",IF(U11_E!AB11=\"\",\"\",U11_E!AB11),IF($AV$7=\"F\",IF(U11_F!AB11=\"\",\"\",U11_F!AB11),IF($AV$7=\"G\",IF(U11_G!AB11=\"\",\"\",U11_G!AB11),IF($AV$7=\"H\",IF(U11_H!AB11=\"\",\"\",U11_H!AB11),\"\")))))))))","v":""},{"$f":"IF($AV$7=\"\",\"\",IF($AV$7=\"A\",IF(U11_A!AC11=\"\",\"\",U11_A!AC11),IF($AV$7=\"B\",IF(U11_B!AC11=\"\",\"\",U11_B!AC11),IF($AV$7=\"C\",IF(U11_C!AC11=\"\",\"\",U11_C!AC11),IF($AV$7=\"D\",IF(U11_D!AC11=\"\",\"\",U11_D!AC11),IF($AV$7=\"E\",IF(U11_E!AC11=\"\",\"\",U11_E!AC11),IF($AV$7=\"F\",IF(U11_F!AC11=\"\",\"\",U11_F!AC11),IF($AV$7=\"G\",IF(U11_G!AC11=\"\",\"\",U11_G!AC11),IF($AV$7=\"H\",IF(U11_H!AC11=\"\",\"\",U11_H!AC11),\"\")))))))))","v":""},{"$f":"IF($AV$7=\"\",\"\",IF($AV$7=\"A\",IF(U11_A!AD11=\"\",\"\",U11_A!AD11),IF($AV$7=\"B\",IF(U11_B!AD11=\"\",\"\",U11_B!AD11),IF($AV$7=\"C\",IF(U11_C!AD11=\"\",\"\",U11_C!AD11),IF($AV$7=\"D\",IF(U11_D!AD11=\"\",\"\",U11_D!AD11),IF($AV$7=\"E\",IF(U11_E!AD11=\"\",\"\",U11_E!AD11),IF($AV$7=\"F\",IF(U11_F!AD11=\"\",\"\",U11_F!AD11),IF($AV$7=\"G\",IF(U11_G!AD11=\"\",\"\",U11_G!AD11),IF($AV$7=\"H\",IF(U11_H!AD11=\"\",\"\",U11_H!AD11),\"\")))))))))","v":""},{"$f":"IF($AV$7=\"\",\"\",IF($AV$7=\"A\",IF(U11_A!AE11=\"\",\"\",U11_A!AE11),IF($AV$7=\"B\",IF(U11_B!AE11=\"\",\"\",U11_B!AE11),IF($AV$7=\"C\",IF(U11_C!AE11=\"\",\"\",U11_C!AE11),IF($AV$7=\"D\",IF(U11_D!AE11=\"\",\"\",U11_D!AE11),IF($AV$7=\"E\",IF(U11_E!AE11=\"\",\"\",U11_E!AE11),IF($AV$7=\"F\",IF(U11_F!AE11=\"\",\"\",U11_F!AE11),IF($AV$7=\"G\",IF(U11_G!AE11=\"\",\"\",U11_G!AE11),IF($AV$7=\"H\",IF(U11_H!AE11=\"\",\"\",U11_H!AE11),\"\")))))))))","v":""},{"$f":"IF($AV$7=\"\",\"\",IF($AV$7=\"A\",IF(U11_A!AF11=\"\",\"\",U11_A!AF11),IF($AV$7=\"B\",IF(U11_B!AF11=\"\",\"\",U11_B!AF11),IF($AV$7=\"C\",IF(U11_C!AF11=\"\",\"\",U11_C!AF11),IF($AV$7=\"D\",IF(U11_D!AF11=\"\",\"\",U11_D!AF11),IF($AV$7=\"E\",IF(U11_E!AF11=\"\",\"\",U11_E!AF11),IF($AV$7=\"F\",IF(U11_F!AF11=\"\",\"\",U11_F!AF11),IF($AV$7=\"G\",IF(U11_G!AF11=\"\",\"\",U11_G!AF11),IF($AV$7=\"H\",IF(U11_H!AF11=\"\",\"\",U11_H!AF11),\"\")))))))))","v":""},{"$f":"IF($AV$7=\"\",\"\",IF($AV$7=\"A\",IF(U11_A!AG11=\"\",\"\",U11_A!AG11),IF($AV$7=\"B\",IF(U11_B!AG11=\"\",\"\",U11_B!AG11),IF($AV$7=\"C\",IF(U11_C!AG11=\"\",\"\",U11_C!AG11),IF($AV$7=\"D\",IF(U11_D!AG11=\"\",\"\",U11_D!AG11),IF($AV$7=\"E\",IF(U11_E!AG11=\"\",\"\",U11_E!AG11),IF($AV$7=\"F\",IF(U11_F!AG11=\"\",\"\",U11_F!AG11),IF($AV$7=\"G\",IF(U11_G!AG11=\"\",\"\",U11_G!AG11),IF($AV$7=\"H\",IF(U11_H!AG11=\"\",\"\",U11_H!AG11),\"\")))))))))","v":""},{"$f":"IF($AV$7=\"\",\"\",IF($AV$7=\"A\",IF(U11_A!AH11=\"\",\"\",U11_A!AH11),IF($AV$7=\"B\",IF(U11_B!AH11=\"\",\"\",U11_B!AH11),IF($AV$7=\"C\",IF(U11_C!AH11=\"\",\"\",U11_C!AH11),IF($AV$7=\"D\",IF(U11_D!AH11=\"\",\"\",U11_D!AH11),IF($AV$7=\"E\",IF(U11_E!AH11=\"\",\"\",U11_E!AH11),IF($AV$7=\"F\",IF(U11_F!AH11=\"\",\"\",U11_F!AH11),IF($AV$7=\"G\",IF(U11_G!AH11=\"\",\"\",U11_G!AH11),IF($AV$7=\"H\",IF(U11_H!AH11=\"\",\"\",U11_H!AH11),\"\")))))))))","v":""},{"$f":"IF($AV$7=\"\",\"\",IF($AV$7=\"A\",IF(U11_A!AI11=\"\",\"\",U11_A!AI11),IF($AV$7=\"B\",IF(U11_B!AI11=\"\",\"\",U11_B!AI11),IF($AV$7=\"C\",IF(U11_C!AI11=\"\",\"\",U11_C!AI11),IF($AV$7=\"D\",IF(U11_D!AI11=\"\",\"\",U11_D!AI11),IF($AV$7=\"E\",IF(U11_E!AI11=\"\",\"\",U11_E!AI11),IF($AV$7=\"F\",IF(U11_F!AI11=\"\",\"\",U11_F!AI11),IF($AV$7=\"G\",IF(U11_G!AI11=\"\",\"\",U11_G!AI11),IF($AV$7=\"H\",IF(U11_H!AI11=\"\",\"\",U11_H!AI11),\"\")))))))))","v":""},{"$f":"IF($AV$7=\"\",\"\",IF($AV$7=\"A\",IF(U11_A!AJ11=\"\",\"\",U11_A!AJ11),IF($AV$7=\"B\",IF(U11_B!AJ11=\"\",\"\",U11_B!AJ11),IF($AV$7=\"C\",IF(U11_C!AJ11=\"\",\"\",U11_C!AJ11),IF($AV$7=\"D\",IF(U11_D!AJ11=\"\",\"\",U11_D!AJ11),IF($AV$7=\"E\",IF(U11_E!AJ11=\"\",\"\",U11_E!AJ11),IF($AV$7=\"F\",IF(U11_F!AJ11=\"\",\"\",U11_F!AJ11),IF($AV$7=\"G\",IF(U11_G!AJ11=\"\",\"\",U11_G!AJ11),IF($AV$7=\"H\",IF(U11_H!AJ11=\"\",\"\",U11_H!AJ11),\"\")))))))))","v":""},{"$f":"IF($AV$7=\"\",\"\",IF($AV$7=\"A\",IF(U11_A!AK11=\"\",\"\",U11_A!AK11),IF($AV$7=\"B\",IF(U11_B!AK11=\"\",\"\",U11_B!AK11),IF($AV$7=\"C\",IF(U11_C!AK11=\"\",\"\",U11_C!AK11),IF($AV$7=\"D\",IF(U11_D!AK11=\"\",\"\",U11_D!AK11),IF($AV$7=\"E\",IF(U11_E!AK11=\"\",\"\",U11_E!AK11),IF($AV$7=\"F\",IF(U11_F!AK11=\"\",\"\",U11_F!AK11),IF($AV$7=\"G\",IF(U11_G!AK11=\"\",\"\",U11_G!AK11),IF($AV$7=\"H\",IF(U11_H!AK11=\"\",\"\",U11_H!AK11),\"\")))))))))","v":""},{"$f":"IF($AV$7=\"\",\"\",IF($AV$7=\"A\",IF(U11_A!AL11=\"\",\"\",U11_A!AL11),IF($AV$7=\"B\",IF(U11_B!AL11=\"\",\"\",U11_B!AL11),IF($AV$7=\"C\",IF(U11_C!AL11=\"\",\"\",U11_C!AL11),IF($AV$7=\"D\",IF(U11_D!AL11=\"\",\"\",U11_D!AL11),IF($AV$7=\"E\",IF(U11_E!AL11=\"\",\"\",U11_E!AL11),IF($AV$7=\"F\",IF(U11_F!AL11=\"\",\"\",U11_F!AL11),IF($AV$7=\"G\",IF(U11_G!AL11=\"\",\"\",U11_G!AL11),IF($AV$7=\"H\",IF(U11_H!AL11=\"\",\"\",U11_H!AL11),\"\")))))))))","v":""},{"$f":"IF($AV$7=\"\",\"\",IF($AV$7=\"A\",IF(U11_A!AM11=\"\",\"\",U11_A!AM11),IF($AV$7=\"B\",IF(U11_B!AM11=\"\",\"\",U11_B!AM11),IF($AV$7=\"C\",IF(U11_C!AM11=\"\",\"\",U11_C!AM11),IF($AV$7=\"D\",IF(U11_D!AM11=\"\",\"\",U11_D!AM11),IF($AV$7=\"E\",IF(U11_E!AM11=\"\",\"\",U11_E!AM11),IF($AV$7=\"F\",IF(U11_F!AM11=\"\",\"\",U11_F!AM11),IF($AV$7=\"G\",IF(U11_G!AM11=\"\",\"\",U11_G!AM11),IF($AV$7=\"H\",IF(U11_H!AM11=\"\",\"\",U11_H!AM11),\"\")))))))))","v":""},{"$f":"IF($AV$7=\"\",\"\",IF($AV$7=\"A\",IF(U11_A!AN11=\"\",\"\",U11_A!AN11),IF($AV$7=\"B\",IF(U11_B!AN11=\"\",\"\",U11_B!AN11),IF($AV$7=\"C\",IF(U11_C!AN11=\"\",\"\",U11_C!AN11),IF($AV$7=\"D\",IF(U11_D!AN11=\"\",\"\",U11_D!AN11),IF($AV$7=\"E\",IF(U11_E!AN11=\"\",\"\",U11_E!AN11),IF($AV$7=\"F\",IF(U11_F!AN11=\"\",\"\",U11_F!AN11),IF($AV$7=\"G\",IF(U11_G!AN11=\"\",\"\",U11_G!AN11),IF($AV$7=\"H\",IF(U11_H!AN11=\"\",\"\",U11_H!AN11),\"\")))))))))","v":""},{"$f":"IF($AV$7=\"\",\"\",IF($AV$7=\"A\",IF(U11_A!AO11=\"\",\"\",U11_A!AO11),IF($AV$7=\"B\",IF(U11_B!AO11=\"\",\"\",U11_B!AO11),IF($AV$7=\"C\",IF(U11_C!AO11=\"\",\"\",U11_C!AO11),IF($AV$7=\"D\",IF(U11_D!AO11=\"\",\"\",U11_D!AO11),IF($AV$7=\"E\",IF(U11_E!AO11=\"\",\"\",U11_E!AO11),IF($AV$7=\"F\",IF(U11_F!AO11=\"\",\"\",U11_F!AO11),IF($AV$7=\"G\",IF(U11_G!AO11=\"\",\"\",U11_G!AO11),IF($AV$7=\"H\",IF(U11_H!AO11=\"\",\"\",U11_H!AO11),\"\")))))))))","v":""},{"$f":"IF($AV$7=\"\",\"\",IF($AV$7=\"A\",IF(U11_A!AP11=\"\",\"\",U11_A!AP11),IF($AV$7=\"B\",IF(U11_B!AP11=\"\",\"\",U11_B!AP11),IF($AV$7=\"C\",IF(U11_C!AP11=\"\",\"\",U11_C!AP11),IF($AV$7=\"D\",IF(U11_D!AP11=\"\",\"\",U11_D!AP11),IF($AV$7=\"E\",IF(U11_E!AP11=\"\",\"\",U11_E!AP11),IF($AV$7=\"F\",IF(U11_F!AP11=\"\",\"\",U11_F!AP11),IF($AV$7=\"G\",IF(U11_G!AP11=\"\",\"\",U11_G!AP11),IF($AV$7=\"H\",IF(U11_H!AP11=\"\",\"\",U11_H!AP11),\"\")))))))))","v":""},{"$f":"IF($AV$7=\"\",\"\",IF($AV$7=\"A\",IF(U11_A!AQ11=\"\",\"\",U11_A!AQ11),IF($AV$7=\"B\",IF(U11_B!AQ11=\"\",\"\",U11_B!AQ11),IF($AV$7=\"C\",IF(U11_C!AQ11=\"\",\"\",U11_C!AQ11),IF($AV$7=\"D\",IF(U11_D!AQ11=\"\",\"\",U11_D!AQ11),IF($AV$7=\"E\",IF(U11_E!AQ11=\"\",\"\",U11_E!AQ11),IF($AV$7=\"F\",IF(U11_F!AQ11=\"\",\"\",U11_F!AQ11),IF($AV$7=\"G\",IF(U11_G!AQ11=\"\",\"\",U11_G!AQ11),IF($AV$7=\"H\",IF(U11_H!AQ11=\"\",\"\",U11_H!AQ11),\"\")))))))))","v":""},{"$f":"IF($AV$7=\"\",\"\",IF($AV$7=\"A\",IF(U11_A!AR11=\"\",\"\",U11_A!AR11),IF($AV$7=\"B\",IF(U11_B!AR11=\"\",\"\",U11_B!AR11),IF($AV$7=\"C\",IF(U11_C!AR11=\"\",\"\",U11_C!AR11),IF($AV$7=\"D\",IF(U11_D!AR11=\"\",\"\",U11_D!AR11),IF($AV$7=\"E\",IF(U11_E!AR11=\"\",\"\",U11_E!AR11),IF($AV$7=\"F\",IF(U11_F!AR11=\"\",\"\",U11_F!AR11),IF($AV$7=\"G\",IF(U11_G!AR11=\"\",\"\",U11_G!AR11),IF($AV$7=\"H\",IF(U11_H!AR11=\"\",\"\",U11_H!AR11),\"\")))))))))","v":""},{"$f":"IF($AV$7=\"\",\"\",IF($AV$7=\"A\",IF(U11_A!AS11=\"\",\"\",U11_A!AS11),IF($AV$7=\"B\",IF(U11_B!AS11=\"\",\"\",U11_B!AS11),IF($AV$7=\"C\",IF(U11_C!AS11=\"\",\"\",U11_C!AS11),IF($AV$7=\"D\",IF(U11_D!AS11=\"\",\"\",U11_D!AS11),IF($AV$7=\"E\",IF(U11_E!AS11=\"\",\"\",U11_E!AS11),IF($AV$7=\"F\",IF(U11_F!AS11=\"\",\"\",U11_F!AS11),IF($AV$7=\"G\",IF(U11_G!AS11=\"\",\"\",U11_G!AS11),IF($AV$7=\"H\",IF(U11_H!AS11=\"\",\"\",U11_H!AS11),\"\")))))))))","v":""},{"$f":"IF($AV$7=\"\",\"\",IF($AV$7=\"A\",IF(U11_A!AT11=\"\",\"\",U11_A!AT11),IF($AV$7=\"B\",IF(U11_B!AT11=\"\",\"\",U11_B!AT11),IF($AV$7=\"C\",IF(U11_C!AT11=\"\",\"\",U11_C!AT11),IF($AV$7=\"D\",IF(U11_D!AT11=\"\",\"\",U11_D!AT11),IF($AV$7=\"E\",IF(U11_E!AT11=\"\",\"\",U11_E!AT11),IF($AV$7=\"F\",IF(U11_F!AT11=\"\",\"\",U11_F!AT11),IF($AV$7=\"G\",IF(U11_G!AT11=\"\",\"\",U11_G!AT11),IF($AV$7=\"H\",IF(U11_H!AT11=\"\",\"\",U11_H!AT11),\"\")))))))))","v":""}]
[]
["Données fournies au candidat"]
[{"$f":"IF($AV$7=\"\",\"\",IF($AV$7=\"A\",IF(U11_A!A14=\"\",\"\",U11_A!A14),IF($AV$7=\"B\",IF(U11_B!A14=\"\",\"\",U11_B!A14),IF($AV$7=\"C\",IF(U11_C!A14=\"\",\"\",U11_C!A14),IF($AV$7=\"D\",IF(U11_D!A14=\"\",\"\",U11_D!A14),IF($AV$7=\"E\",IF(U11_E!A14=\"\",\"\",U11_E!A14),IF($AV$7=\"F\",IF(U11_F!A14=\"\",\"\",U11_F!A14),IF($AV$7=\"G\",IF(U11_G!A14=\"\",\"\",U11_G!A14),IF($AV$7=\"H\",IF(U11_H!A14=\"\",\"\",U11_H!A14),\"\")))))))))","v":""},"Le dossier technique du bien sur supports papiers ou supports numériques",null,null,null,null,null,null,null,null,null,null,null,null,null,null,null,null,null,null,null,null,null,{"$f":"IF($AV$7=\"\",\"\",IF($AV$7=\"A\",IF(U11_A!X14=\"\",\"\",U11_A!X14),IF($AV$7=\"B\",IF(U11_B!X14=\"\",\"\",U11_B!X14),IF($AV$7=\"C\",IF(U11_C!X14=\"\",\"\",U11_C!X14),IF($AV$7=\"D\",IF(U11_D!X14=\"\",\"\",U11_D!X14),IF($AV$7=\"E\",IF(U11_E!X14=\"\",\"\",U11_E!X14),IF($AV$7=\"F\",IF(U11_F!X14=\"\",\"\",U11_F!X14),IF($AV$7=\"G\",IF(U11_G!X14=\"\",\"\",U11_G!X14),IF($AV$7=\"H\",IF(U11_H!X14=\"\",\"\",U11_H!X14),\"\")))))))))","v":""},"Le cahier des charges fonctionnel"]
[{"$f":"IF($AV$7=\"\",\"\",IF($AV$7=\"A\",IF(U11_A!A15=\"\",\"\",U11_A!A15),IF($AV$7=\"B\",IF(U11_B!A15=\"\",\"\",U11_B!A15),IF($AV$7=\"C\",IF(U11_C!A15=\"\",\"\",U11_C!A15),IF($AV$7=\"D\",IF(U11_D!A15=\"\",\"\",U11_D!A15),IF($AV$7=\"E\",IF(U11_E!A15=\"\",\"\",U11_E!A15),IF($AV$7=\"F\",IF(U11_F!A15=\"\",\"\",U11_F!A15),IF($AV$7=\"G\",IF(U11_G!A15=\"\",\"\",U11_G!A15),IF($AV$7=\"H\",IF(U11_H!A15=\"\",\"\",U11_H!A15),\"\")))))))))","v":""},"Le bien et les conditions de son environnement",null,null,null,null,null,null,null,null,null,null,null,null,null,null,null,null,null,null,null,null,null,{"$f":"IF($AV$7=\"\",\"\",IF($AV$7=\"A\",IF(U11_A!X15=\"\",\"\",U11_A!X15),IF($AV$7=\"B\",IF(U11_B!X15=\"\",\"\",U11_B!X15),IF($AV$7=\"C\",IF(U11_C!X15=\"\",\"\",U11_C!X15),IF($AV$7=\"D\",IF(U11_D!X15=\"\",\"\",U11_D!X15),IF($AV$7=\"E\",IF(U11_E!X15=\"\",\"\",U11_E!X15),IF($AV$7=\"F\",IF(U11_F!X15=\"\",\"\",U11_F!X15),IF($AV$7=\"G\",IF(U11_G!X15=\"\",\"\",U11_G!X15),IF($AV$7=\"H\",IF(U11_H!X15=\"\",\"\",U11_H!X15),\"\")))))))))","v":""},"Equipement informatique"]
[{"$f":"IF($AV$7=\"\",\"\",IF($AV$7=\"A\",IF(U11_A!A16=\"\",\"\",U11_A!A16),IF($AV$7=\"B\",IF(U11_B!A16=\"\",\"\",U11_B!A16),IF($AV$7=\"C\",IF(U11_C!A16=\"\",\"\",U11_C!A16),IF($AV$7=\"D\",IF(U11_D!A16=\"\",\"\",U11_D!A16),IF($AV$7=\"E\",IF(U11_E!A16=\"\",\"\",U11_E!A16),IF($AV$7=\"F\",IF(U11_F!A16=\"\",\"\",U11_F!A16),IF($AV$7=\"G\",IF(U11_G!A16=\"\",\"\",U11_G!A16),IF($AV$7=\"H\",IF(U11_H!A16=\"\",\"\",U11_H!A16),\"\")))))))))","v":""},"Les normes",null,null,null,null,null,null,null,null,null,null,null,null,null,null,null,null,null,null,null,null,null,{"$f":"IF($AV$7=\"\",\"\",IF($AV$7=\"A\",IF(U11_A!X16=\"\",\"\",U11_A!X16),IF($AV$7=\"B\",IF(U11_B!X16=\"\",\"\",U11_B!X16),IF($AV$7=\"C\",IF(U11_C!X16=\"\",\"\",U11_C!X16),IF($AV$7=\"D\",IF(U11_D!X16=\"\",\"\",U11_D!X16),IF($AV$7=\"E\",IF(U11_E!X16=\"\",\"\",U11_E!X16),IF($AV$7=\"F\",IF(U11_F!X16=\"\",\"\",U11_F!X16),IF($AV$7=\"G\",IF(U11_G!X16=\"\",\"\",U11_G!X16),IF($AV$7=\"H\",IF(U11_H!X16=\"\",\"\",U11_H!X16),\"\")))))))))","v":""},"Les logiciels"]
[{"$f":"IF($AV$7=\"\",\"\",IF($AV$7=\"A\",IF(U11_A!A17=\"\",\"\",U11_A!A17),IF($AV$7=\"B\",IF(U11_B!A17=\"\",\"\",U11_B!A17),IF($AV$7=\"C\",IF(U11_C!A17=\"\",\"\",U11_C!A17),IF($AV$7=\"D\",IF(U11_D!A17=\"\",\"\",U11_D!A17),IF($AV$7=\"E\",IF(U11_E!A17=\"\",\"\",U11_E!A17),IF($AV$7=\"F\",IF(U11_F!A17=\"\",\"\",U11_F!A17),IF($AV$7=\"G\",IF(U11_G!A17=\"\",\"\",U11_G!A17),IF($AV$7=\"H\",IF(U11_H!A17=\"\",\"\",U11_H!A17),\"\")))))))))","v":""},"Toutes documentations techniques",null,null,null,null,null,null,null,null,null,null,null,null,null,null,null,null,null,null,null,null,null,{"$f":"IF($AV$7=\"\",\"\",IF($AV$7=\"A\",IF(U11_A!X17=\"\",\"\",U11_A!X17),IF($AV$7=\"B\",IF(U11_B!X17=\"\",\"\",U11_B!X17),IF($AV$7=\"C\",IF(U11_C!X17=\"\",\"\",U11_C!X17),IF($AV$7=\"D\",IF(U11_D!X17=\"\",\"\",U11_D!X17),IF($AV$7=\"E\",IF(U11_E!X17=\"\",\"\",U11_E!X17),IF($AV$7=\"F\",IF(U11_F!X17=\"\",\"\",U11_F!X17),IF($AV$7=\"G\",IF(U11_G!X17=\"\",\"\",U11_G!X17),IF($AV$7=\"H\",IF(U11_H!X17=\"\",\"\",U11_H!X17),\"\")))))))))","v":""},"Le plan de prévention"]
[{"$f":"IF($AV$7=\"\",\"\",IF($AV$7=\"A\",IF(U11_A!A18=\"\",\"\",U11_A!A18),IF($AV$7=\"B\",IF(U11_B!A18=\"\",\"\",U11_B!A18),IF($AV$7=\"C\",IF(U11_C!A18=\"\",\"\",U11_C!A18),IF($AV$7=\"D\",IF(U11_D!A18=\"\",\"\",U11_D!A18),IF($AV$7=\"E\",IF(U11_E!A18=\"\",\"\",U11_E!A18),IF($AV$7=\"F\",IF(U11_F!A18=\"\",\"\",U11_F!A18),IF($AV$7=\"G\",IF(U11_G!A18=\"\",\"\",U11_G!A18),IF($AV$7=\"H\",IF(U11_H!A18=\"\",\"\",U11_H!A18),\"\")))))))))","v":""},"Document unique d’évaluation des risques",null,null,null,null,null,null,null,null,null,null,null,null,null,null,null,null,null,null,null,null,null,{"$f":"IF($AV$7=\"\",\"\",IF($AV$7=\"A\",IF(U11_A!X18=\"\",\"\",U11_A!X18),IF($AV$7=\"B\",IF(U11_B!X18=\"\",\"\",U11_B!X18),IF($AV$7=\"C\",IF(U11_C!X18=\"\",\"\",U11_C!X18),IF($AV$7=\"D\",IF(U11_D!X18=\"\",\"\",U11_D!X18),IF($AV$7=\"E\",IF(U11_E!X18=\"\",\"\",U11_E!X18),IF($AV$7=\"F\",IF(U11_F!X18=\"\",\"\",U11_F!X18),IF($AV$7=\"G\",IF(U11_G!X18=\"\",\"\",U11_G!X18),IF($AV$7=\"H\",IF(U11_H!X18=\"\",\"\",U11_H!X18),\"\")))))))))","v":""}]
[{"$f":"IF($AV$7=\"\",\"\",IF($AV$7=\"A\",IF(U11_A!A19=\"\",\"\",U11_A!A19),IF($AV$7=\"B\",IF(U11_B!A19=\"\",\"\",U11_B!A19),IF($AV$7=\"C\",IF(U11_C!A19=\"\",\"\",U11_C!A19),IF($AV$7=\"D\",IF(U11_D!A19=\"\",\"\",U11_D!A19),IF($AV$7=\"E\",IF(U11_E!A19=\"\",\"\",U11_E!A19),IF($AV$7=\"F\",IF(U11_F!A19=\"\",\"\",U11_F!A19),IF($AV$7=\"G\",IF(U11_G!A19=\"\",\"\",U11_G!A19),IF($AV$7=\"H\",IF(U11_H!A19=\"\",\"\",U11_H!A19),\"\")))))))))","v":""},null,null,null,null,null,null,null,null,null,null,null,null,null,null,null,null,null,null,null,null,null,null,{"$f":"IF($AV$7=\"\",\"\",IF($AV$7=\"A\",IF(U11_A!X19=\"\",\"\",U11_A!X19),IF($AV$7=\"B\",IF(U11_B!X19=\"\",\"\",U11_B!X19),IF($AV$7=\"C\",IF(U11_C!X19=\"\",\"\",U11_C!X19),IF($AV$7=\"D\",IF(U11_D!X19=\"\",\"\",U11_D!X19),IF($AV$7=\"E\",IF(U11_E!X19=\"\",\"\",U11_E!X19),IF($AV$7=\"F\",IF(U11_F!X19=\"\",\"\",U11_F!X19),IF($AV$7=\"G\",IF(U11_G!X19=\"\",\"\",U11_G!X19),IF($AV$7=\"H\",IF(U11_H!X19=\"\",\"\",U11_H!X19),\"\")))))))))","v":""}]
[{"$f":"IF($AV$7=\"\",\"\",IF($AV$7=\"A\",IF(U11_A!A20=\"\",\"\",U11_A!A20),IF($AV$7=\"B\",IF(U11_B!A20=\"\",\"\",U11_B!A20),IF($AV$7=\"C\",IF(U11_C!A20=\"\",\"\",U11_C!A20),IF($AV$7=\"D\",IF(U11_D!A20=\"\",\"\",U11_D!A20),IF($AV$7=\"E\",IF(U11_E!A20=\"\",\"\",U11_E!A20),IF($AV$7=\"F\",IF(U11_F!A20=\"\",\"\",U11_F!A20),IF($AV$7=\"G\",IF(U11_G!A20=\"\",\"\",U11_G!A20),IF($AV$7=\"H\",IF(U11_H!A20=\"\",\"\",U11_H!A20),\"\")))))))))","v":""},null,null,null,null,null,null,null,null,null,null,null,null,null,null,null,null,null,null,null,null,null,null,{"$f":"IF($AV$7=\"\",\"\",IF($AV$7=\"A\",IF(U11_A!X20=\"\",\"\",U11_A!X20),IF($AV$7=\"B\",IF(U11_B!X20=\"\",\"\",U11_B!X20),IF($AV$7=\"C\",IF(U11_C!X20=\"\",\"\",U11_C!X20),IF($AV$7=\"D\",IF(U11_D!X20=\"\",\"\",U11_D!X20),IF($AV$7=\"E\",IF(U11_E!X20=\"\",\"\",U11_E!X20),IF($AV$7=\"F\",IF(U11_F!X20=\"\",\"\",U11_F!X20),IF($AV$7=\"G\",IF(U11_G!X20=\"\",\"\",U11_G!X20),IF($AV$7=\"H\",IF(U11_H!X20=\"\",\"\",U11_H!X20),\"\")))))))))","v":""}]
[{"$f":"IF($AV$7=\"\",\"\",IF($AV$7=\"A\",IF(U11_A!A21=\"\",\"\",U11_A!A21),IF($AV$7=\"B\",IF(U11_B!A21=\"\",\"\",U11_B!A21),IF($AV$7=\"C\",IF(U11_C!A21=\"\",\"\",U11_C!A21),IF($AV$7=\"D\",IF(U11_D!A21=\"\",\"\",U11_D!A21),IF($AV$7=\"E\",IF(U11_E!A21=\"\",\"\",U11_E!A21),IF($AV$7=\"F\",IF(U11_F!A21=\"\",\"\",U11_F!A21),IF($AV$7=\"G\",IF(U11_G!A21=\"\",\"\",U11_G!A21),IF($AV$7=\"H\",IF(U11_H!A21=\"\",\"\",U11_H!A21),\"\")))))))))","v":""},null,null,null,null,null,null,null,null,null,null,null,null,null,null,null,null,null,null,null,null,null,null,{"$f":"IF($AV$7=\"\",\"\",IF($AV$7=\"A\",IF(U11_A!X21=\"\",\"\",U11_A!X21),IF($AV$7=\"B\",IF(U11_B!X21=\"\",\"\",U11_B!X21),IF($AV$7=\"C\",IF(U11_C!X21=\"\",\"\",U11_C!X21),IF($AV$7=\"D\",IF(U11_D!X21=\"\",\"\",U11_D!X21),IF($AV$7=\"E\",IF(U11_E!X21=\"\",\"\",U11_E!X21),IF($AV$7=\"F\",IF(U11_F!X21=\"\",\"\",U11_F!X21),IF($AV$7=\"G\",IF(U11_G!X21=\"\",\"\",U11_G!X21),IF($AV$7=\"H\",IF(U11_H!X21=\"\",\"\",U11_H!X21),\"\")))))))))","v":""}]
["     ÇRepérer les données fournies",null,null,null,null,null,null,null,null,null,null,null,null,null,null,null,null,null,null,null,null,null,null,null,"ÇRepérer les données fournies"]
["Travail demandé"]
[{"$f":"IF($AV$7=\"\",\"\",IF($AV$7=\"A\",IF(U11_A!A24=\"\",\"\",U11_A!A24),IF($AV$7=\"B\",IF(U11_B!A24=\"\",\"\",U11_B!A24),IF($AV$7=\"C\",IF(U11_C!A24=\"\",\"\",U11_C!A24),IF($AV$7=\"D\",IF(U11_D!A24=\"\",\"\",U11_D!A24),IF($AV$7=\"E\",IF(U11_E!A24=\"\",\"\",U11_E!A24),IF($AV$7=\"F\",IF(U11_F!A24=\"\",\"\",U11_F!A24),IF($AV$7=\"G\",IF(U11_G!A24=\"\",\"\",U11_G!A24),IF($AV$7=\"H\",IF(U11_H!A24=\"\",\"\",U11_H!A24),\"\")))))))))","v":""},"A1-T1",null,"Réaliser la maintenance corrective - Diagnostiquer les pannes."]
[{"$f":"IF($AV$7=\"\",\"\",IF($AV$7=\"A\",IF(U11_A!A25=\"\",\"\",U11_A!A25),IF($AV$7=\"B\",IF(U11_B!A25=\"\",\"\",U11_B!A25),IF($AV$7=\"C\",IF(U11_C!A25=\"\",\"\",U11_C!A25),IF($AV$7=\"D\",IF(U11_D!A25=\"\",\"\",U11_D!A25),IF($AV$7=\"E\",IF(U11_E!A25=\"\",\"\",U11_E!A25),IF($AV$7=\"F\",IF(U11_F!A25=\"\",\"\",U11_F!A25),IF($AV$7=\"G\",IF(U11_G!A25=\"\",\"\",U11_G!A25),IF($AV$7=\"H\",IF(U11_H!A25=\"\",\"\",U11_H!A25),\"\")))))))))","v":""},"A1-T2",null,"Réaliser la maintenance corrective - Préparer sa réparation, son dépannage. "]
[{"$f":"IF($AV$7=\"\",\"\",IF($AV$7=\"A\",IF(U11_A!A26=\"\",\"\",U11_A!A26),IF($AV$7=\"B\",IF(U11_B!A26=\"\",\"\",U11_B!A26),IF($AV$7=\"C\",IF(U11_C!A26=\"\",\"\",U11_C!A26),IF($AV$7=\"D\",IF(U11_D!A26=\"\",\"\",U11_D!A26),IF($AV$7=\"E\",IF(U11_E!A26=\"\",\"\",U11_E!A26),IF($AV$7=\"F\",IF(U11_F!A26=\"\",\"\",U11_F!A26),IF($AV$7=\"G\",IF(U11_G!A26=\"\",\"\",U11_G!A26),IF($AV$7=\"H\",IF(U11_H!A26=\"\",\"\",U11_H!A26),\"\")))))))))","v":""},"A1-T3",null,"Réaliser la maintenance corrective - Réaliser des réparations, des dépannages dans les domaines : mécanique, électrique, pneumatique, hydraulique."]
["Consulter le référentiel des activités professionnelles pour obtenir le détail des tâches."]
["Ç Repérer les tâches demandées (ce sont celles qui correspondent à l’unité dans le référentiel de certification, à l’exclusion de toute autre)"]
["Appréciation globale et proposition de note : "]
[]
["Noms et signatures des évaluateurs :\n\n\n",null,null,null,null,null,null,null,null,null,null,null,null,null,null,null,null,null,null,null,null,null,null,null,null,null,null,null,null,null,null,null,null,null,null,"Note proposée :          ",null,null,null,null,{"$f":"IF(AI93=\"\",\"\",AI93)","v":""},null,null,"/20"]
[null,null,null,null,null,null,null,null,null,null,null,null,null,null,null,null,null,null,null,null,null,null,null,null,null,null,null,null,null,null,null,null,null,null,null,"Note affectée de son coefficient :",null,null,null,null,{"$f":"IF(AO31=\"\",\"\",AO31*3)","v":""},null,null,"/60"]
["Baccalauréat professionnel « maintenance des équipements industriels »  – Unité U 11",null,null,null,null,null,null,null,null,null,null,null,null,null,null,null,null,null,null,null,null,null,null,null,null,null,null,null,null,null,null,null,null,null,"Validé",null,null,null,"-       Synthèse    +"]
[]
["CP 2.1 Analyser le fonctionnement et l’organisation d’un système",null,null,null,null,null,null,null,null,null,null,null,null,null,null,null,null,null,null,null,null,null,null,null,null,null,null,null,null,null,"Evalué",null,null,null,{"$f":"IF(AE35=\"Non Evalué\",\"NE\",IF(AE35=\"Evalué\",\"E\",\"\"))","v":"E"},{"$f":"COUNTIF(AI37:AL56,\"Validé\")","v":0},{"$f":"COUNTIF(AI37:AL56,\"Non Validé\")","v":0},{"$f":"COUNTIF(AI37:AL56,\"Non Evalué\")","v":0},null,null,null,null,null,null,null,null,null,{"$f":"IF(AE35=\"\",\"Souhaitez-vous évaluer la compétence ?\",IF(AND(AE35=\"Non Evalué\",OR(AJ35<>0,AK35<>0)),\"Vous avez choisi de ne pas évaluer la compétence. Ne rien indiquez dans la colonne Validé.\",IF(AND(AE35=\"Evalué\",OR(AI37=\"\",AI39=\"\",AI41=\"\",AI43=\"\",AI45=\"\",AI47=\"\",AI49=\"\",AI51=\"\",AI53=\"\",AI55=\"\")),\"Vous avez choisi d'évaluer la compétence. Indiquez pour chaques actions : Validé, Non Validé ou Non Evalué.\",IF(OR(AE35=\"Non Evalué\",(AJ35+AK35)=0),\"\",CONCATENATE(ROUND((100*AJ36/(AJ36+AK36)),0),\" % d'actions validées. \",AJ35,\" validée(s) sur \",AJ35+AK35,\" . Conseil: Au maximum , grisez \",ROUND((100*AJ36/(AJ36+AK36))*8/100,0),\" colonnes\")))))","v":"Vous avez choisi d'évaluer la compétence. Indiquez pour chaques actions : Validé, Non Validé ou Non Evalué."}]
[null,null,null,null,null,null,null,null,null,null,null,null,null,null,null,null,null,null,null,null,null,null,null,null,null,null,null,null,null,null,null,null,null,null,null,{"$f":"SUMPRODUCT((AI37:AL56=\"Validé\")*(Bareme!AE6:AE25))","v":0},{"$f":"SUMPRODUCT((AI37:AL56=\"Non Validé\")*(Bareme!AE6:AE25))","v":0}]
[1,null,"Décoder toutes formes de représentation.",null,null,null,null,null,null,null,null,null,null,"Les représentations sont lues et comprises sans erreur.",null,null,null,null,null,null,null,null,null,null,null,null,null,null,null,null,null,null,null,null,null,null,null,null,null,null,null,null,null,null,null,null,null,0]
[]
[2,null,"Décrire le système dans son environnement d’un point de vue fonctionnel, temporel et structurel :\n• Identifier les fonctions opératives.\n• Identifier la fonction :\n     - sécurité,\n     - dialogue (homme/machine) et surveillance,\n     - alimentation en énergie.\n• Décrire le rôle et les caractéristiques des composants réalisant ces fonctions.\n• Lire et décoder l’évolution temporelle du bien.\n• Décoder les modes de production et/ou l’exploitation du bien.\n",null,null,null,null,null,null,null,null,null,null,"La description à l’écrit ou à l’oral doit être conforme : \n- au système,\n- à son environnement,\n- aux normes en vigueur.\n"]
[]
[null,null,null,null,null,null,null,null,null,null,null,null,null,"Ce descriptif intègre toutes les fonctions opératives du système et leurs interactions."]
[]
[null,null,null,null,null,null,null,null,null,null,null,null,null,"Chaque fonction est repérée et délimitée sur les documents et sur le bien sans erreur."]
[]
[null,null,null,null,null,null,null,null,null,null,null,null,null,"Les composants qui participent à chaque fonction sont identifiés"]
[null,null,null,null,null,null,null,null,null,null,null,null,null,null,null,null,null,null,null,null,null,null,null,null,null,null,null,null,null,null,null,null,null,null,null,null,null,null,"Commentaires:"]
[null,null,null,null,null,null,null,null,null,null,null,null,null,"La description à l’écrit ou à l’oral doit être conforme aux composants et à leurs fonctions."]
[]
[null,null,null,null,null,null,null,null,null,null,null,null,null,"L’évolution temporelle est assimilée et décrite."]
[]
[null,null,null,null,null,null,null,null,null,null,null,null,null,"Le fonctionnement est compris."]
[]
[3,null,"Analyser tout ou partie du bilan énergétique.",null,null,null,null,null,null,null,null,null,null,"Les causes des pertes sont identifiées. "]
[]
[null,null,null,null,null,null,null,null,null,null,null,null,null,"Les paramètres de puissance, de travail et de rendement sont identifiés et éventuellement calculés ou vérifiés."]
[]
["CP 2.2 Analyser les solutions mécaniques réalisant les fonctions opératives.",null,null,null,null,null,null,null,null,null,null,null,null,null,null,null,null,null,null,null,null,null,null,null,null,null,null,null,null,null,"Evalué",null,null,null,{"$f":"IF(AE57=\"Non Evalué\",\"NE\",IF(AE57=\"Evalué\",\"E\",\"\"))","v":"E"},{"$f":"COUNTIF(AI59:AL88,\"Validé\")","v":0},{"$f":"COUNTIF(AI59:AL88,\"Non Validé\")","v":0},{"$f":"COUNTIF(AI59:AL88,\"Non Evalué\")","v":0},null,null,null,null,null,null,null,null,null,{"$f":"IF(AE57=\"\",\"Souhaitez-vous évaluer la compétence ?\",IF(AND(AE57=\"Non Evalué\",OR(AJ57<>0,AK57<>0)),\"Vous avez choisi de ne pas évaluer la compétence. Ne rien indiquez dans la colonne Validé.\",IF(AND(AE57=\"Evalué\",OR(AI59=\"\",AI61=\"\",AI63=\"\",AI65=\"\",AI67=\"\",AI69=\"\",AI71=\"\",AI73=\"\",AI75=\"\",AI77=\"\",AI79=\"\",AI81=\"\",AI83=\"\",AI85=\"\",AI87=\"\")),\"Vous avez choisi d'évaluer la compétence. Indiquez pour chaques actions : Validé, Non Validé ou Non Evalué.\",IF(OR(AE57=\"Non Evalué\",(AJ57+AK57)=0),\"\",CONCATENATE(ROUND((100*AJ58/(AJ58+AK58)),0),\" % d'actions validées. \",AJ57,\" validée(s) sur \",AJ57+AK57,\" . Conseil: Au maximum , grisez \",ROUND((100*AJ58/(AJ58+AK58))*8/100,0),\" colonnes\")))))","v":"Vous avez choisi d'évaluer la compétence. Indiquez pour chaques actions : Validé, Non Validé ou Non Evalué."}]
[null,null,null,null,null,null,null,null,null,null,null,null,null,null,null,null,null,null,null,null,null,null,null,null,null,null,null,null,null,null,null,null,null,null,null,{"$f":"SUMPRODUCT((AI59:AL88=\"Validé\")*(Bareme!AE28:AE57))","v":0},{"$f":"SUMPRODUCT((AI59:AL88=\"Non Validé\")*(Bareme!AE28:AE57))","v":0}]
[1,null,"Décoder toutes formes de représentation des solutions constructives.",null,null,null,null,null,null,null,null,null,null,"Les plans, schémas, documents techniques, éclatés… sont lus et compris sans erreur.",null,null,null,null,null,null,null,null,null,null,null,null,null,null,null,null,null,null,null,null,null,null,null,null,null,null,null,null,null,null,null,null,null,0]
[]
[2,null,"Identifier, pour chaque solution technique    (assemblage, guidage, étanchéité, transmission,  transformation des mouvements…) :\n• les composants utilisés,\n• les performances attendues ou constatées,\n• les caractéristiques,\n• les conditions d’utilisations,\n• les risques de défaillances.\n",null,null,null,null,null,null,null,null,null,null,"Les composants constitutifs des solutions et leurs éléments d’assemblage sont identifiés et désignés exhaustivement et sans erreur."]
[]
[null,null,null,null,null,null,null,null,null,null,null,null,null,"Les caractéristiques, les performances, les conditions d’utilisations, les risques de défaillances sont explicités."]
[]
[null,null,null,null,null,null,null,null,null,null,null,null,null,"Les dérives de fonctionnement sont justifiées."]
[]
[3,null,"Décrire la cinématique des parties opératives.",null,null,null,null,null,null,null,null,null,null,"La description (schéma cinématique) doit être conforme :\n- aux solutions mécaniques,"]
[]
[null,null,null,null,null,null,null,null,null,null,null,null,null,"La description (schéma cinématique) doit être conforme :\n- à son environnement,"]
[]
[null,null,null,null,null,null,null,null,null,null,null,null,null,"La description (schéma cinématique) doit être conforme :\n- aux normes de représentation en vigueur.",null,null,null,null,null,null,null,null,null,null,null,null,null,null,null,null,null,null,null,null,null,null,null,null,"Commentaires:"]
[]
[4,null,"Décrire et vérifier par le calcul des solutions constructives.",null,null,null,null,null,null,null,null,null,null,"La description est conforme à l’ensemble étudié"]
[]
[null,null,null,null,null,null,null,null,null,null,null,null,null,"Les formules sont correctement utilisées."]
[]
[null,null,null,null,null,null,null,null,null,null,null,null,null,"Les logiciels de calcul et les résultats fournis sont correctement exploités."]
[]
[5,null,"Etablir des schémas et croquis des solutions techniques.",null,null,null,null,null,null,null,null,null,null,"Les schémas réalisés sont conformes aux solutions et respectent les  normes de représentation."]
[]
[null,null,null,null,null,null,null,null,null,null,null,null,null,"Les croquis sont exploitables."]
[]
[6,null,"Rédiger des consignes :\n- gammes de montage démontage,\n- procédures de réglages.\n",null,null,null,null,null,null,null,null,null,null,"Les gammes et les procédures sont exploitables et répondent au besoin."]
[]
[null,null,null,null,null,null,null,null,null,null,null,null,null,"Le plan de prévention est réactualisé."]
[]
[null,null,null,null,null,null,null,null,null,null,null,null,null,"Le langage utilisé est correct et approprié."]
[]
[]
[null,null,null,null,{"$f":"IF(OR(I101=\"\",AND(AJ35=\"\",AK35=\"\",AJ57=\"\",AK57=\"\")=0),\"\",CONCATENATE(\"PROPOSITION: \",CEILING(I101,0.5),\"/20 (\",ROUND(100*COUNTIF(U100:U101,\"E\")/(COUNTIF(U100:U101,\"E\")+COUNTIF(U100:U101,\"NE\")),0),\"% des compétences évaluées).\"))","v":""}]
[]
[]
[null,null,null,null,"Proposition des évaluateurs:"]
[]
[]
[]
[null,null,null,null,"Ne pas effacer"]
[null,null,null,null,null,null,null,null,null,null,null,null,null,null,"Statistique U11 de "]
[null,null,null,null,null,null,null,null,null,null,null,null,null,null,"Compétences",{"$f":"IF(AE4=\"\",\"\",AE4)","v":{"$error":"#N/A"}},"Satisfaction maximale","Satisfaction moyenne","Statistique U31 de ","Coefficients","Validée ou Non Validée"]
[null,null,"Somme",null,null,null,null,null,{"$f":"SUM((P100:P101))","v":0},null,{"$f":"SUM(Q100:Q101)","v":800},null,null,null,{"$f":"A37","v":1},{"$f":"IF(OR(U100=\"NE\",U100=\"\"),\"\",T100*S100)","v":0},{"$f":"IF(OR(U100=\"NE\",U100=\"\"),\"\",T100*8)","v":320},{"$f":"IF(OR(U100=\"NE\",U100=\"\"),\"\",Q100/2)","v":160},{"$f":"AV37","v":0},{"$f":"Bareme!AE4","v":40},{"$f":"IF(AI35=\"\",\"\",AI35)","v":"E"}]
[null,null,"Moyenne /20",null,null,null,null,null,{"$f":"IF($I$100=0,\"\",K101*$I$100/$K$100)","v":""},null,20,null,null,null,{"$f":"A39","v":2},{"$f":"IF(OR(U101=\"NE\",U101=\"\"),\"\",T101*S101)","v":0},{"$f":"IF(OR(U101=\"NE\",U101=\"\"),\"\",T101*8)","v":480},{"$f":"IF(OR(U101=\"NE\",U101=\"\"),\"\",Q101/2)","v":240},{"$f":"AV59","v":0},{"$f":"Bareme!AE26","v":60},{"$f":"IF(AI57=\"\",\"\",AI57)","v":"E"}]
[null,null,"Moyenne /60",null,null,null,null,null,{"$f":"IF($I$100=0,\"\",K102*$I$100/$K$100)","v":""},null,60]
[null,null,null,null,"Ne pas effacer"]

{"sheet":"U2","index":5,"n_rows":137,"n_cols":48,"rows_kept":137,"cut":false,"hidden":true,"merged":[[40,0,41,1],[42,0,43,1],[44,0,51,1],[52,0,55,1],[56,0,57,1],[104,0,107,1],[92,0,103,1],[90,0,91,1],[86,0,89,1],[60,0,61,1],[62,0,63,1],[64,0,65,1],[66,0,67,1],[68,0,69,1],[70,0,71,1],[72,0,73,1],[74,0,75,1],[76,0,77,1],[78,0,79,1],[80,0,81,1],[82,0,83,33],[50,13,51,33],[52,13,53,33],[74,2,75,12],[76,2,77,12],[78,2,79,12],[80,2,81,12],[5,47,5,48],[6,47,7,48],[54,34,55,37],[56,34,57,37],[25,3,25,45],[26,3,26,45],[27,3,27,45],[28,3,28,45],[29,3,29,45],[38,47,39,49],[40,13,41,33],[40,34,41,37],[42,13,43,33],[42,34,43,37],[44,13,45,33],[46,13,47,33],[48,13,49,33],[40,2,41,12],[42,2,43,12],[44,2,51,12],[44,34,45,37],[68,2,69,12],[70,2,71,12],[72,2,73,12],[52,2,55,12],[56,2,57,12],[60,2,61,12],[62,2,63,12],[64,2,65,12],[66,2,67,12],[82,38,82,45],[83,38,83,45],[74,34,75,37],[76,34,77,37],[78,34,79,37],[80,34,81,37],[54,13,55,33],[98,13,99,33],[46,34,47,37],[48,34,49,37],[50,34,51,37],[52,34,53,37],[55,38,57,45],[64,34,65,37],[73,38,81,45],[56,13,57,33],[72,13,73,33],[74,13,75,33],[76,13,77,33],[78,13,79,33],[80,13,81,33],[96,13,97,33],[64,13,65,33],[82,34,83,37],[123,4,125,39],[126,4,128,33],[126,34,128,39],[131,14,131,27],[88,34,89,37],[90,34,91,37],[90,13,91,33],[92,13,93,33],[92,34,93,37],[94,13,95,33],[94,34,95,37],[90,38,107,45],[104,34,105,37],[106,34,107,37],[102,34,103,37],[86,2,89,12],[90,2,91,12],[92,2,103,12],[104,2,107,12],[100,13,101,33],[102,13,103,33],[104,13,105,33],[84,47,85,49],[86,13,87,33],[86,34,87,37],[88,13,89,33],[106,13,107,33],[58,0,59,29],[58,30,59,33],[96,34,97,37],[84,0,85,29],[84,30,85,33],[98,34,99,37],[100,34,101,37],[70,13,71,33],[70,34,71,37],[66,13,67,33],[66,34,67,37],[68,13,69,33],[68,34,69,37],[58,47,59,49],[60,13,61,33],[60,34,61,37],[62,13,63,33],[62,34,63,37],[72,34,73,37],[36,0,37,33],[36,34,37,37],[36,38,36,45],[37,38,37,45],[38,0,39,29],[38,30,39,33],[33,0,33,45],[34,0,35,34],[34,35,34,39],[34,40,34,42],[34,43,34,45],[35,35,35,39],[35,40,35,42],[35,43,35,45],[30,0,30,45],[32,0,32,45],[28,1,28,2],[29,1,29,2],[26,1,26,2],[27,1,27,2],[24,0,24,45],[25,1,25,2],[22,1,22,22],[22,24,22,45],[19,1,19,22],[19,24,19,45],[20,1,20,22],[20,24,20,45],[21,1,21,22],[21,24,21,45],[16,1,16,22],[16,24,16,45],[17,1,17,22],[17,24,17,45],[18,1,18,22],[18,24,18,45],[12,0,12,45],[13,1,13,22],[13,24,13,45],[14,1,14,22],[14,24,14,45],[15,1,15,22],[15,24,15,45],[5,30,5,45],[6,0,6,45],[7,0,7,45],[8,0,8,45],[9,0,9,45],[10,0,10,45],[0,0,0,45],[1,0,1,45],[2,0,2,22],[2,23,2,29],[2,30,2,45],[3,0,5,22],[3,23,3,29],[3,30,4,45],[4,23,4,29],[5,23,5,29]]}
["Baccalauréat professionnel « maintenance des équipements industriels »"]
["Épreuve E2 (Unité U2) : ANALYSE ETPREPARATION D’UNE ACTIVITE DE MAINTENANCE"]
["Établissement : (tampon)",null,null,null,null,null,null,null,null,null,null,null,null,null,null,null,null,null,null,null,null,null,null,"Session : ",null,null,null,null,null,null,{"$f":"IF(Bilan!B2=\"\",\"\",Bilan!B2)","v":""}]
[{"$f":"IF(Bilan!B3=\"\",\"\",Bilan!B3)","v":""},null,null,null,null,null,null,null,null,null,null,null,null,null,null,null,null,null,null,null,null,null,null,"Nom du candidat:",null,null,null,null,null,null,{"$f":"IF(INDEX((Bilan!B5:B34),(MATCH(RIGHT(CELL(\"nomfichier\",A1),LEN(CELL(\"nomfichier\",A1))-FIND(\"]\",CELL(\"nomfichier\",A1))),Bilan!E5:E34,0)))=\"\",\"\",INDEX((Bilan!B5:B34),(MATCH(RIGHT(CELL(\"nomfichier\",A1),LEN(CELL(\"nomfichier\",A1))-FIND(\"]\",CELL(\"nomfichier\",A1))),Bilan!E5:E34,0))))","v":{"$error":"#N/A"}}]
[null,null,null,null,null,null,null,null,null,null,null,null,null,null,null,null,null,null,null,null,null,null,null,"Prénom : "]
[null,null,null,null,null,null,null,null,null,null,null,null,null,null,null,null,null,null,null,null,null,null,null,"Date de l'évaluation:",null,null,null,null,null,null,null,null,null,null,null,null,null,null,null,null,null,null,null,null,null,null,null,"Choisisser votre situation"]
["Lieu d’évaluation :"]
["      Etablissement"]
["      Entreprise :       "]
["Description sommaire du travail demandé :"]
[{"$f":"IF($AV$7=\"\",\"\",IF($AV$7=\"A\",IF(U2_A!A11=\"\",\"\",U2_A!A11),IF($AV$7=\"B\",IF(U2_B!A11=\"\",\"\",U2_B!A11),IF($AV$7=\"C\",IF(U2_C!A11=\"\",\"\",U2_C!A11),IF($AV$7=\"D\",IF(U2_D!A11=\"\",\"\",U2_D!A11),IF($AV$7=\"E\",IF(U2_E!A11=\"\",\"\",U2_E!A11),IF($AV$7=\"F\",IF(U2_F!A11=\"\",\"\",U2_F!A11),IF($AV$7=\"G\",IF(U2_G!A11=\"\",\"\",U2_G!A11),IF($AV$7=\"H\",IF(U2_H!A11=\"\",\"\",U2_H!A11),\"\")))))))))","v":""},{"$f":"IF($AV$7=\"\",\"\",IF($AV$7=\"A\",IF(U2_A!B11=\"\",\"\",U2_A!B11),IF($AV$7=\"B\",IF(U2_B!B11=\"\",\"\",U2_B!B11),IF($AV$7=\"C\",IF(U2_C!B11=\"\",\"\",U2_C!B11),IF($AV$7=\"D\",IF(U2_D!B11=\"\",\"\",U2_D!B11),IF($AV$7=\"E\",IF(U2_E!B11=\"\",\"\",U2_E!B11),IF($AV$7=\"F\",IF(U2_F!B11=\"\",\"\",U2_F!B11),IF($AV$7=\"G\",IF(U2_G!B11=\"\",\"\",U2_G!B11),IF($AV$7=\"H\",IF(U2_H!B11=\"\",\"\",U2_H!B11),\"\")))))))))","v":""},{"$f":"IF($AV$7=\"\",\"\",IF($AV$7=\"A\",IF(U2_A!C11=\"\",\"\",U2_A!C11),IF($AV$7=\"B\",IF(U2_B!C11=\"\",\"\",U2_B!C11),IF($AV$7=\"C\",IF(U2_C!C11=\"\",\"\",U2_C!C11),IF($AV$7=\"D\",IF(U2_D!C11=\"\",\"\",U2_D!C11),IF($AV$7=\"E\",IF(U2_E!C11=\"\",\"\",U2_E!C11),IF($AV$7=\"F\",IF(U2_F!C11=\"\",\"\",U2_F!C11),IF($AV$7=\"G\",IF(U2_G!C11=\"\",\"\",U2_G!C11),IF($AV$7=\"H\",IF(U2_H!C11=\"\",\"\",U2_H!C11),\"\")))))))))","v":""},{"$f":"IF($AV$7=\"\",\"\",IF($AV$7=\"A\",IF(U2_A!D11=\"\",\"\",U2_A!D11),IF($AV$7=\"B\",IF(U2_B!D11=\"\",\"\",U2_B!D11),IF($AV$7=\"C\",IF(U2_C!D11=\"\",\"\",U2_C!D11),IF($AV$7=\"D\",IF(U2_D!D11=\"\",\"\",U2_D!D11),IF($AV$7=\"E\",IF(U2_E!D11=\"\",\"\",U2_E!D11),IF($AV$7=\"F\",IF(U2_F!D11=\"\",\"\",U2_F!D11),IF($AV$7=\"G\",IF(U2_G!D11=\"\",\"\",U2_G!D11),IF($AV$7=\"H\",IF(U2_H!D11=\"\",\"\",U2_H!D11),\"\")))))))))","v":""},{"$f":"IF($AV$7=\"\",\"\",IF($AV$7=\"A\",IF(U2_A!E11=\"\",\"\",U2_A!E11),IF($AV$7=\"B\",IF(U2_B!E11=\"\",\"\",U2_B!E11),IF($AV$7=\"C\",IF(U2_C!E11=\"\",\"\",U2_C!E11),IF($AV$7=\"D\",IF(U2_D!E11=\"\",\"\",U2_D!E11),IF($AV$7=\"E\",IF(U2_E!E11=\"\",\"\",U2_E!E11),IF($AV$7=\"F\",IF(U2_F!E11=\"\",\"\",U2_F!E11),IF($AV$7=\"G\",IF(U2_G!E11=\"\",\"\",U2_G!E11),IF($AV$7=\"H\",IF(U2_H!E11=\"\",\"\",U2_H!E11),\"\")))))))))","v":""},{"$f":"IF($AV$7=\"\",\"\",IF($AV$7=\"A\",IF(U2_A!F11=\"\",\"\",U2_A!F11),IF($AV$7=\"B\",IF(U2_B!F11=\"\",\"\",U2_B!F11),IF($AV$7=\"C\",IF(U2_C!F11=\"\",\"\",U2_C!F11),IF($AV$7=\"D\",IF(U2_D!F11=\"\",\"\",U2_D!F11),IF($AV$7=\"E\",IF(U2_E!F11=\"\",\"\",U2_E!F11),IF($AV$7=\"F\",IF(U2_F!F11=\"\",\"\",U2_F!F11),IF($AV$7=\"G\",IF(U2_G!F11=\"\",\"\",U2_G!F11),IF($AV$7=\"H\",IF(U2_H!F11=\"\",\"\",U2_H!F11),\"\")))))))))","v":""},{"$f":"IF($AV$7=\"\",\"\",IF($AV$7=\"A\",IF(U2_A!G11=\"\",\"\",U2_A!G11),IF($AV$7=\"B\",IF(U2_B!G11=\"\",\"\",U2_B!G11),IF($AV$7=\"C\",IF(U2_C!G11=\"\",\"\",U2_C!G11),IF($AV$7=\"D\",IF(U2_D!G11=\"\",\"\",U2_D!G11),IF($AV$7=\"E\",IF(U2_E!G11=\"\",\"\",U2_E!G11),IF($AV$7=\"F\",IF(U2_F!G11=\"\",\"\",U2_F!G11),IF($AV$7=\"G\",IF(U2_G!G11=\"\",\"\",U2_G!G11),IF($AV$7=\"H\",IF(U2_H!G11=\"\",\"\",U2_H!G11),\"\")))))))))","v":""},{"$f":"IF($AV$7=\"\",\"\",IF($AV$7=\"A\",IF(U2_A!H11=\"\",\"\",U2_A!H11),IF($AV$7=\"B\",IF(U2_B!H11=\"\",\"\",U2_B!H11),IF($AV$7=\"C\",IF(U2_C!H11=\"\",\"\",U2_C!H11),IF($AV$7=\"D\",IF(U2_D!H11=\"\",\"\",U2_D!H11),IF($AV$7=\"E\",IF(U2_E!H11=\"\",\"\",U2_E!H11),IF($AV$7=\"F\",IF(U2_F!H11=\"\",\"\",U2_F!H11),IF($AV$7=\"G\",IF(U2_G!H11=\"\",\"\",U2_G!H11),IF($AV$7=\"H\",IF(U2_H!H11=\"\",\"\",U2_H!H11),\"\")))))))))","v":""},{"$f":"IF($AV$7=\"\",\"\",IF($AV$7=\"A\",IF(U2_A!I11=\"\",\"\",U2_A!I11),IF($AV$7=\"B\",IF(U2_B!I11=\"\",\"\",U2_B!I11),IF($AV$7=\"C\",IF(U2_C!I11=\"\",\"\",U2_C!I11),IF($AV$7=\"D\",IF(U2_D!I11=\"\",\"\",U2_D!I11),IF($AV$7=\"E\",IF(U2_E!I11=\"\",\"\",U2_E!I11),IF($AV$7=\"F\",IF(U2_F!I11=\"\",\"\",U2_F!I11),IF($AV$7=\"G\",IF(U2_G!I11=\"\",\"\",U2_G!I11),IF($AV$7=\"H\",IF(U2_H!I11=\"\",\"\",U2_H!I11),\"\")))))))))","v":""},{"$f":"IF($AV$7=\"\",\"\",IF($AV$7=\"A\",IF(U2_A!J11=\"\",\"\",U2_A!J11),IF($AV$7=\"B\",IF(U2_B!J11=\"\",\"\",U2_B!J11),IF($AV$7=\"C\",IF(U2_C!J11=\"\",\"\",U2_C!J11),IF($AV$7=\"D\",IF(U2_D!J11=\"\",\"\",U2_D!J11),IF($AV$7=\"E\",IF(U2_E!J11=\"\",\"\",U2_E!J11),IF($AV$7=\"F\",IF(U2_F!J11=\"\",\"\",U2_F!J11),IF($AV$7=\"G\",IF(U2_G!J11=\"\",\"\",U2_G!J11),IF($AV$7=\"H\",IF(U2_H!J11=\"\",\"\",U2_H!J11),\"\")))))))))","v":""},{"$f":"IF($AV$7=\"\",\"\",IF($AV$7=\"A\",IF(U2_A!K11=\"\",\"\",U2_A!K11),IF($AV$7=\"B\",IF(U2_B!K11=\"\",\"\",U2_B!K11),IF($AV$7=\"C\",IF(U2_C!K11=\"\",\"\",U2_C!K11),IF($AV$7=\"D\",IF(U2_D!K11=\"\",\"\",U2_D!K11),IF($AV$7=\"E\",IF(U2_E!K11=\"\",\"\",U2_E!K11),IF($AV$7=\"F\",IF(U2_F!K11=\"\",\"\",U2_F!K11),IF($AV$7=\"G\",IF(U2_G!K11=\"\",\"\",U2_G!K11),IF($AV$7=\"H\",IF(U2_H!K11=\"\",\"\",U2_H!K11),\"\")))))))))","v":""},{"$f":"IF($AV$7=\"\",\"\",IF($AV$7=\"A\",IF(U2_A!L11=\"\",\"\",U2_A!L11),IF($AV$7=\"B\",IF(U2_B!L11=\"\",\"\",U2_B!L11),IF($AV$7=\"C\",IF(U2_C!L11=\"\",\"\",U2_C!L11),IF($AV$7=\"D\",IF(U2_D!L11=\"\",\"\",U2_D!L11),IF($AV$7=\"E\",IF(U2_E!L11=\"\",\"\",U2_E!L11),IF($AV$7=\"F\",IF(U2_F!L11=\"\",\"\",U2_F!L11),IF($AV$7=\"G\",IF(U2_G!L11=\"\",\"\",U2_G!L11),IF($AV$7=\"H\",IF(U2_H!L11=\"\",\"\",U2_H!L11),\"\")))))))))","v":""},{"$f":"IF($AV$7=\"\",\"\",IF($AV$7=\"A\",IF(U2_A!M11=\"\",\"\",U2_A!M11),IF($AV$7=\"B\",IF(U2_B!M11=\"\",\"\",U2_B!M11),IF($AV$7=\"C\",IF(U2_C!M11=\"\",\"\",U2_C!M11),IF($AV$7=\"D\",IF(U2_D!M11=\"\",\"\",U2_D!M11),IF($AV$7=\"E\",IF(U2_E!M11=\"\",\"\",U2_E!M11),IF($AV$7=\"F\",IF(U2_F!M11=\"\",\"\",U2_F!M11),IF($AV$7=\"G\",IF(U2_G!M11=\"\",\"\",U2_G!M11),IF($AV$7=\"H\",IF(U2_H!M11=\"\",\"\",U2_H!M11),\"\")))))))))","v":""},{"$f":"IF($AV$7=\"\",\"\",IF($AV$7=\"A\",IF(U2_A!N11=\"\",\"\",U2_A!N11),IF($AV$7=\"B\",IF(U2_B!N11=\"\",\"\",U2_B!N11),IF($AV$7=\"C\",IF(U2_C!N11=\"\",\"\",U2_C!N11),IF($AV$7=\"D\",IF(U2_D!N11=\"\",\"\",U2_D!N11),IF($AV$7=\"E\",IF(U2_E!N11=\"\",\"\",U2_E!N11),IF($AV$7=\"F\",IF(U2_F!N11=\"\",\"\",U2_F!N11),IF($AV$7=\"G\",IF(U2_G!N11=\"\",\"\",U2_G!N11),IF($AV$7=\"H\",IF(U2_H!N11=\"\",\"\",U2_H!N11),\"\")))))))))","v":""},{"$f":"IF($AV$7=\"\",\"\",IF($AV$7=\"A\",IF(U2_A!O11=\"\",\"\",U2_A!O11),IF($AV$7=\"B\",IF(U2_B!O11=\"\",\"\",U2_B!O11),IF($AV$7=\"C\",IF(U2_C!O11=\"\",\"\",U2_C!O11),IF($AV$7=\"D\",IF(U2_D!O11=\"\",\"\",U2_D!O11),IF($AV$7=\"E\",IF(U2_E!O11=\"\",\"\",U2_E!O11),IF($AV$7=\"F\",IF(U2_F!O11=\"\",\"\",U2_F!O11),IF($AV$7=\"G\",IF(U2_G!O11=\"\",\"\",U2_G!O11),IF($AV$7=\"H\",IF(U2_H!O11=\"\",\"\",U2_H!O11),\"\")))))))))","v":""},{"$f":"IF($AV$7=\"\",\"\",IF($AV$7=\"A\",IF(U2_A!P11=\"\",\"\",U2_A!P11),IF($AV$7=\"B\",IF(U2_B!P11=\"\",\"\",U2_B!P11),IF($AV$7=\"C\",IF(U2_C!P11=\"\",\"\",U2_C!P11),IF($AV$7=\"D\",IF(U2_D!P11=\"\",\"\",U2_D!P11),IF($AV$7=\"E\",IF(U2_E!P11=\"\",\"\",U2_E!P11),IF($AV$7=\"F\",IF(U2_F!P11=\"\",\"\",U2_F!P11),IF($AV$7=\"G\",IF(U2_G!P11=\"\",\"\",U2_G!P11),IF($AV$7=\"H\",IF(U2_H!P11=\"\",\"\",U2_H!P11),\"\")))))))))","v":""},{"$f":"IF($AV$7=\"\",\"\",IF($AV$7=\"A\",IF(U2_A!Q11=\"\",\"\",U2_A!Q11),IF($AV$7=\"B\",IF(U2_B!Q11=\"\",\"\",U2_B!Q11),IF($AV$7=\"C\",IF(U2_C!Q11=\"\",\"\",U2_C!Q11),IF($AV$7=\"D\",IF(U2_D!Q11=\"\",\"\",U2_D!Q11),IF($AV$7=\"E\",IF(U2_E!Q11=\"\",\"\",U2_E!Q11),IF($AV$7=\"F\",IF(U2_F!Q11=\"\",\"\",U2_F!Q11),IF($AV$7=\"G\",IF(U2_G!Q11=\"\",\"\",U2_G!Q11),IF($AV$7=\"H\",IF(U2_H!Q11=\"\",\"\",U2_H!Q11),\"\")))))))))","v":""},{"$f":"IF($AV$7=\"\",\"\",IF($AV$7=\"A\",IF(U2_A!R11=\"\",\"\",U2_A!R11),IF($AV$7=\"B\",IF(U2_B!R11=\"\",\"\",U2_B!R11),IF($AV$7=\"C\",IF(U2_C!R11=\"\",\"\",U2_C!R11),IF($AV$7=\"D\",IF(U2_D!R11=\"\",\"\",U2_D!R11),IF($AV$7=\"E\",IF(U2_E!R11=\"\",\"\",U2_E!R11),IF($AV$7=\"F\",IF(U2_F!R11=\"\",\"\",U2_F!R11),IF($AV$7=\"G\",IF(U2_G!R11=\"\",\"\",U2_G!R11),IF($AV$7=\"H\",IF(U2_H!R11=\"\",\"\",U2_H!R11),\"\")))))))))","v":""},{"$f":"IF($AV$7=\"\",\"\",IF($AV$7=\"A\",IF(U2_A!S11=\"\",\"\",U2_A!S11),IF($AV$7=\"B\",IF(U2_B!S11=\"\",\"\",U2_B!S11),IF($AV$7=\"C\",IF(U2_C!S11=\"\",\"\",U2_C!S11),IF($AV$7=\"D\",IF(U2_D!S11=\"\",\"\",U2_D!S11),IF($AV$7=\"E\",IF(U2_E!S11=\"\",\"\",U2_E!S11),IF($AV$7=\"F\",IF(U2_F!S11=\"\",\"\",U2_F!S11),IF($AV$7=\"G\",IF(U2_G!S11=\"\",\"\",U2_G!S11),IF($AV$7=\"H\",IF(U2_H!S11=\"\",\"\",U2_H!S11),\"\")))))))))","v":""},{"$f":"IF($AV$7=\"\",\"\",IF($AV$7=\"A\",IF(U2_A!T11=\"\",\"\",U2_A!T11),IF($AV$7=\"B\",IF(U2_B!T11=\"\",\"\",U2_B!T11),IF($AV$7=\"C\",IF(U2_C!T11=\"\",\"\",U2_C!T11),IF($AV$7=\"D\",IF(U2_D!T11=\"\",\"\",U2_D!T11),IF($AV$7=\"E\",IF(U2_E!T11=\"\",\"\",U2_E!T11),IF($AV$7=\"F\",IF(U2_F!T11=\"\",\"\",U2_F!T11),IF($AV$7=\"G\",IF(U2_G!T11=\"\",\"\",U2_G!T11),IF($AV$7=\"H\",IF(U2_H!T11=\"\",\"\",U2_H!T11),\"\")))))))))","v":""},{"$f":"IF($AV$7=\"\",\"\",IF($AV$7=\"A\",IF(U2_A!U11=\"\",\"\",U2_A!U11),IF($AV$7=\"B\",IF(U2_B!U11=\"\",\"\",U2_B!U11),IF($AV$7=\"C\",IF(U2_C!U11=\"\",\"\",U2_C!U11),IF($AV$7=\"D\",IF(U2_D!U11=\"\",\"\",U2_D!U11),IF($AV$7=\"E\",IF(U2_E!U11=\"\",\"\",U2_E!U11),IF($AV$7=\"F\",IF(U2_F!U11=\"\",\"\",U2_F!U11),IF($AV$7=\"G\",IF(U2_G!U11=\"\",\"\",U2_G!U11),IF($AV$7=\"H\",IF(U2_H!U11=\"\",\"\",U2_H!U11),\"\")))))))))","v":""},{"$f":"IF($AV$7=\"\",\"\",IF($AV$7=\"A\",IF(U2_A!V11=\"\",\"\",U2_A!V11),IF($AV$7=\"B\",IF(U2_B!V11=\"\",\"\",U2_B!V11),IF($AV$7=\"C\",IF(U2_C!V11=\"\",\"\",U2_C!V11),IF($AV$7=\"D\",IF(U2_D!V11=\"\",\"\",U2_D!V11),IF($AV$7=\"E\",IF(U2_E!V11=\"\",\"\",U2_E!V11),IF($AV$7=\"F\",IF(U2_F!V11=\"\",\"\",U2_F!V11),IF($AV$7=\"G\",IF(U2_G!V11=\"\",\"\",U2_G!V11),IF($AV$7=\"H\",IF(U2_H!V11=\"\",\"\",U2_H!V11),\"\")))))))))","v":""},{"$f":"IF($AV$7=\"\",\"\",IF($AV$7=\"A\",IF(U2_A!W11=\"\",\"\",U2_A!W11),IF($AV$7=\"B\",IF(U2_B!W11=\"\",\"\",U2_B!W11),IF($AV$7=\"C\",IF(U2_C!W11=\"\",\"\",U2_C!W11),IF($AV$7=\"D\",IF(U2_D!W11=\"\",\"\",U2_D!W11),IF($AV$7=\"E\",IF(U2_E!W11=\"\",\"\",U2_E!W11),IF($AV$7=\"F\",IF(U2_F!W11=\"\",\"\",U2_F!W11),IF($AV$7=\"G\",IF(U2_G!W11=\"\",\"\",U2_G!W11),IF($AV$7=\"H\",IF(U2_H!W11=\"\",\"\",U2_H!W11),\"\")))))))))","v":""},{"$f":"IF($AV$7=\"\",\"\",IF($AV$7=\"A\",IF(U2_A!X11=\"\",\"\",U2_A!X11),IF($AV$7=\"B\",IF(U2_B!X11=\"\",\"\",U2_B!X11),IF($AV$7=\"C\",IF(U2_C!X11=\"\",\"\",U2_C!X11),IF($AV$7=\"D\",IF(U2_D!X11=\"\",\"\",U2_D!X11),IF($AV$7=\"E\",IF(U2_E!X11=\"\",\"\",U2_E!X11),IF($AV$7=\"F\",IF(U2_F!X11=\"\",\"\",U2_F!X11),IF($AV$7=\"G\",IF(U2_G!X11=\"\",\"\",U2_G!X11),IF($AV$7=\"H\",IF(U2_H!X11=\"\",\"\",U2_H!X11),\"\")))))))))","v":""},{"$f":"IF($AV$7=\"\",\"\",IF($AV$7=\"A\",IF(U2_A!Y11=\"\",\"\",U2_A!Y11),IF($AV$7=\"B\",IF(U2_B!Y11=\"\",\"\",U2_B!Y11),IF($AV$7=\"C\",IF(U2_C!Y11=\"\",\"\",U2_C!Y11),IF($AV$7=\"D\",IF(U2_D!Y11=\"\",\"\",U2_D!Y11),IF($AV$7=\"E\",IF(U2_E!Y11=\"\",\"\",U2_E!Y11),IF($AV$7=\"F\",IF(U2_F!Y11=\"\",\"\",U2_F!Y11),IF($AV$7=\"G\",IF(U2_G!Y11=\"\",\"\",U2_G!Y11),IF($AV$7=\"H\",IF(U2_H!Y11=\"\",\"\",U2_H!Y11),\"\")))))))))","v":""},{"$f":"IF($AV$7=\"\",\"\",IF($AV$7=\"A\",IF(U2_A!Z11=\"\",\"\",U2_A!Z11),IF($AV$7=\"B\",IF(U2_B!Z11=\"\",\"\",U2_B!Z11),IF($AV$7=\"C\",IF(U2_C!Z11=\"\",\"\",U2_C!Z11),IF($AV$7=\"D\",IF(U2_D!Z11=\"\",\"\",U2_D!Z11),IF($AV$7=\"E\",IF(U2_E!Z11=\"\",\"\",U2_E!Z11),IF($AV$7=\"F\",IF(U2_F!Z11=\"\",\"\",U2_F!Z11),IF($AV$7=\"G\",IF(U2_G!Z11=\"\",\"\",U2_G!Z11),IF($AV$7=\"H\",IF(U2_H!Z11=\"\",\"\",U2_H!Z11),\"\")))))))))","v":""},{"$f":"IF($AV$7=\"\",\"\",IF($AV$7=\"A\",IF(U2_A!AA11=\"\",\"\",U2_A!AA11),IF($AV$7=\"B\",IF(U2_B!AA11=\"\",\"\",U2_B!AA11),IF($AV$7=\"C\",IF(U2_C!AA11=\"\",\"\",U2_C!AA11),IF($AV$7=\"D\",IF(U2_D!AA11=\"\",\"\",U2_D!AA11),IF($AV$7=\"E\",IF(U2_E!AA11=\"\",\"\",U2_E!AA11),IF($AV$7=\"F\",IF(U2_F!AA11=\"\",\"\",U2_F!AA11),IF($AV$7=\"G\",IF(U2_G!AA11=\"\",\"\",U2_G!AA11),IF($AV$7=\"H\",IF(U2_H!AA11=\"\",\"\",U2_H!AA11),\"\")))))))))","v":""},{"$f":"IF($AV$7=\"\",\"\",IF($AV$7=\"A\",IF(U2_A!AB11=\"\",\"\",U2_A!AB11),IF($AV$7=\"B\",IF(U2_B!AB11=\"\",\"\",U2_B!AB11),IF($AV$7=\"C\",IF(U2_C!AB11=\"\",\"\",U2_C!AB11),IF($AV$7=\"D\",IF(U2_D!AB11=\"\",\"\",U2_D!AB11),IF($AV$7=\"E\",IF(U2_E!AB11=\"\",\"\",U2_E!AB11),IF($AV$7=\"F\",IF(U2_F!AB11=\"\",\"\",U2_F!AB11),IF($AV$7=\"G\",IF(U2_G!AB11=\"\",\"\",U2_G!AB11),IF($AV$7=\"H\",IF(U2_H!AB11=\"\",\"\",U2_H!AB11),\"\")))))))))","v":""},{"$f":"IF($AV$7=\"\",\"\",IF($AV$7=\"A\",IF(U2_A!AC11=\"\",\"\",U2_A!AC11),IF($AV$7=\"B\",IF(U2_B!AC11=\"\",\"\",U2_B!AC11),IF($AV$7=\"C\",IF(U2_C!AC11=\"\",\"\",U2_C!AC11),IF($AV$7=\"D\",IF(U2_D!AC11=\"\",\"\",U2_D!AC11),IF($AV$7=\"E\",IF(U2_E!AC11=\"\",\"\",U2_E!AC11),IF($AV$7=\"F\",IF(U2_F!AC11=\"\",\"\",U2_F!AC11),IF($AV$7=\"G\",IF(U2_G!AC11=\"\",\"\",U2_G!AC11),IF($AV$7=\"H\",IF(U2_H!AC11=\"\",\"\",U2_H!AC11),\"\")))))))))","v":""},{"$f":"IF($AV$7=\"\",\"\",IF($AV$7=\"A\",IF(U2_A!AD11=\"\",\"\",U2_A!AD11),IF($AV$7=\"B\",IF(U2_B!AD11=\"\",\"\",U2_B!AD11),IF($AV$7=\"C\",IF(U2_C!AD11=\"\",\"\",U2_C!AD11),IF($AV$7=\"D\",IF(U2_D!AD11=\"\",\"\",U2_D!AD11),IF($AV$7=\"E\",IF(U2_E!AD11=\"\",\"\",U2_E!AD11),IF($AV$7=\"F\",IF(U2_F!AD11=\"\",\"\",U2_F!AD11),IF($AV$7=\"G\",IF(U2_G!AD11=\"\",\"\",U2_G!AD11),IF($AV$7=\"H\",IF(U2_H!AD11=\"\",\"\",U2_H!AD11),\"\")))))))))","v":""},{"$f":"IF($AV$7=\"\",\"\",IF($AV$7=\"A\",IF(U2_A!AE11=\"\",\"\",U2_A!AE11),IF($AV$7=\"B\",IF(U2_B!AE11=\"\",\"\",U2_B!AE11),IF($AV$7=\"C\",IF(U2_C!AE11=\"\",\"\",U2_C!AE11),IF($AV$7=\"D\",IF(U2_D!AE11=\"\",\"\",U2_D!AE11),IF($AV$7=\"E\",IF(U2_E!AE11=\"\",\"\",U2_E!AE11),IF($AV$7=\"F\",IF(U2_F!AE11=\"\",\"\",U2_F!AE11),IF($AV$7=\"G\",IF(U2_G!AE11=\"\",\"\",U2_G!AE11),IF($AV$7=\"H\",IF(U2_H!AE11=\"\",\"\",U2_H!AE11),\"\")))))))))","v":""},{"$f":"IF($AV$7=\"\",\"\",IF($AV$7=\"A\",IF(U2_A!AF11=\"\",\"\",U2_A!AF11),IF($AV$7=\"B\",IF(U2_B!AF11=\"\",\"\",U2_B!AF11),IF($AV$7=\"C\",IF(U2_C!AF11=\"\",\"\",U2_C!AF11),IF($AV$7=\"D\",IF(U2_D!AF11=\"\",\"\",U2_D!AF11),IF($AV$7=\"E\",IF(U2_E!AF11=\"\",\"\",U2_E!AF11),IF($AV$7=\"F\",IF(U2_F!AF11=\"\",\"\",U2_F!AF11),IF($AV$7=\"G\",IF(U2_G!AF11=\"\",\"\",U2_G!AF11),IF($AV$7=\"H\",IF(U2_H!AF11=\"\",\"\",U2_H!AF11),\"\")))))))))","v":""},{"$f":"IF($AV$7=\"\",\"\",IF($AV$7=\"A\",IF(U2_A!AG11=\"\",\"\",U2_A!AG11),IF($AV$7=\"B\",IF(U2_B!AG11=\"\",\"\",U2_B!AG11),IF($AV$7=\"C\",IF(U2_C!AG11=\"\",\"\",U2_C!AG11),IF($AV$7=\"D\",IF(U2_D!AG11=\"\",\"\",U2_D!AG11),IF($AV$7=\"E\",IF(U2_E!AG11=\"\",\"\",U2_E!AG11),IF($AV$7=\"F\",IF(U2_F!AG11=\"\",\"\",U2_F!AG11),IF($AV$7=\"G\",IF(U2_G!AG11=\"\",\"\",U2_G!AG11),IF($AV$7=\"H\",IF(U2_H!AG11=\"\",\"\",U2_H!AG11),\"\")))))))))","v":""},{"$f":"IF($AV$7=\"\",\"\",IF($AV$7=\"A\",IF(U2_A!AH11=\"\",\"\",U2_A!AH11),IF($AV$7=\"B\",IF(U2_B!AH11=\"\",\"\",U2_B!AH11),IF($AV$7=\"C\",IF(U2_C!AH11=\"\",\"\",U2_C!AH11),IF($AV$7=\"D\",IF(U2_D!AH11=\"\",\"\",U2_D!AH11),IF($AV$7=\"E\",IF(U2_E!AH11=\"\",\"\",U2_E!AH11),IF($AV$7=\"F\",IF(U2_F!AH11=\"\",\"\",U2_F!AH11),IF($AV$7=\"G\",IF(U2_G!AH11=\"\",\"\",U2_G!AH11),IF($AV$7=\"H\",IF(U2_H!AH11=\"\",\"\",U2_H!AH11),\"\")))))))))","v":""},{"$f":"IF($AV$7=\"\",\"\",IF($AV$7=\"A\",IF(U2_A!AI11=\"\",\"\",U2_A!AI11),IF($AV$7=\"B\",IF(U2_B!AI11=\"\",\"\",U2_B!AI11),IF($AV$7=\"C\",IF(U2_C!AI11=\"\",\"\",U2_C!AI11),IF($AV$7=\"D\",IF(U2_D!AI11=\"\",\"\",U2_D!AI11),IF($AV$7=\"E\",IF(U2_E!AI11=\"\",\"\",U2_E!AI11),IF($AV$7=\"F\",IF(U2_F!AI11=\"\",\"\",U2_F!AI11),IF($AV$7=\"G\",IF(U2_G!AI11=\"\",\"\",U2_G!AI11),IF($AV$7=\"H\",IF(U2_H!AI11=\"\",\"\",U2_H!AI11),\"\")))))))))","v":""},{"$f":"IF($AV$7=\"\",\"\",IF($AV$7=\"A\",IF(U2_A!AJ11=\"\",\"\",U2_A!AJ11),IF($AV$7=\"B\",IF(U2_B!AJ11=\"\",\"\",U2_B!AJ11),IF($AV$7=\"C\",IF(U2_C!AJ11=\"\",\"\",U2_C!AJ11),IF($AV$7=\"D\",IF(U2_D!AJ11=\"\",\"\",U2_D!AJ11),IF($AV$7=\"E\",IF(U2_E!AJ11=\"\",\"\",U2_E!AJ11),IF($AV$7=\"F\",IF(U2_F!AJ11=\"\",\"\",U2_F!AJ11),IF($AV$7=\"G\",IF(U2_G!AJ11=\"\",\"\",U2_G!AJ11),IF($AV$7=\"H\",IF(U2_H!AJ11=\"\",\"\",U2_H!AJ11),\"\")))))))))","v":""},{"$f":"IF($AV$7=\"\",\"\",IF($AV$7=\"A\",IF(U2_A!AK11=\"\",\"\",U2_A!AK11),IF($AV$7=\"B\",IF(U2_B!AK11=\"\",\"\",U2_B!AK11),IF($AV$7=\"C\",IF(U2_C!AK11=\"\",\"\",U2_C!AK11),IF($AV$7=\"D\",IF(U2_D!AK11=\"\",\"\",U2_D!AK11),IF($AV$7=\"E\",IF(U2_E!AK11=\"\",\"\",U2_E!AK11),IF($AV$7=\"F\",IF(U2_F!AK11=\"\",\"\",U2_F!AK11),IF($AV$7=\"G\",IF(U2_G!AK11=\"\",\"\",U2_G!AK11),IF($AV$7=\"H\",IF(U2_H!AK11=\"\",\"\",U2_H!AK11),\"\")))))))))","v":""},{"$f":"IF($AV$7=\"\",\"\",IF($AV$7=\"A\",IF(U2_A!AL11=\"\",\"\",U2_A!AL11),IF($AV$7=\"B\",IF(U2_B!AL11=\"\",\"\",U2_B!AL11),IF($AV$7=\"C\",IF(U2_C!AL11=\"\",\"\",U2_C!AL11),IF($AV$7=\"D\",IF(U2_D!AL11=\"\",\"\",U2_D!AL11),IF($AV$7=\"E\",IF(U2_E!AL11=\"\",\"\",U2_E!AL11),IF($AV$7=\"F\",IF(U2_F!AL11=\"\",\"\",U2_F!AL11),IF($AV$7=\"G\",IF(U2_G!AL11=\"\",\"\",U2_G!AL11),IF($AV$7=\"H\",IF(U2_H!AL11=\"\",\"\",U2_H!AL11),\"\")))))))))","v":""},{"$f":"IF($AV$7=\"\",\"\",IF($AV$7=\"A\",IF(U2_A!AM11=\"\",\"\",U2_A!AM11),IF($AV$7=\"B\",IF(U2_B!AM11=\"\",\"\",U2_B!AM11),IF($AV$7=\"C\",IF(U2_C!AM11=\"\",\"\",U2_C!AM11),IF($AV$7=\"D\",IF(U2_D!AM11=\"\",\"\",U2_D!AM11),IF($AV$7=\"E\",IF(U2_E!AM11=\"\",\"\",U2_E!AM11),IF($AV$7=\"F\",IF(U2_F!AM11=\"\",\"\",U2_F!AM11),IF($AV$7=\"G\",IF(U2_G!AM11=\"\",\"\",U2_G!AM11),IF($AV$7=\"H\",IF(U2_H!AM11=\"\",\"\",U2_H!AM11),\"\")))))))))","v":""},{"$f":"IF($AV$7=\"\",\"\",IF($AV$7=\"A\",IF(U2_A!AN11=\"\",\"\",U2_A!AN11),IF($AV$7=\"B\",IF(U2_B!AN11=\"\",\"\",U2_B!AN11),IF($AV$7=\"C\",IF(U2_C!AN11=\"\",\"\",U2_C!AN11),IF($AV$7=\"D\",IF(U2_D!AN11=\"\",\"\",U2_D!AN11),IF($AV$7=\"E\",IF(U2_E!AN11=\"\",\"\",U2_E!AN11),IF($AV$7=\"F\",IF(U2_F!AN11=\"\",\"\",U2_F!AN11),IF($AV$7=\"G\",IF(U2_G!AN11=\"\",\"\",U2_G!AN11),IF($AV$7=\"H\",IF(U2_H!AN11=\"\",\"\",U2_H!AN11),\"\")))))))))","v":""},{"$f":"IF($AV$7=\"\",\"\",IF($AV$7=\"A\",IF(U2_A!AO11=\"\",\"\",U2_A!AO11),IF($AV$7=\"B\",IF(U2_B!AO11=\"\",\"\",U2_B!AO11),IF($AV$7=\"C\",IF(U2_C!AO11=\"\",\"\",U2_C!AO11),IF($AV$7=\"D\",IF(U2_D!AO11=\"\",\"\",U2_D!AO11),IF($AV$7=\"E\",IF(U2_E!AO11=\"\",\"\",U2_E!AO11),IF($AV$7=\"F\",IF(U2_F!AO11=\"\",\"\",U2_F!AO11),IF($AV$7=\"G\",IF(U2_G!AO11=\"\",\"\",U2_G!AO11),IF($AV$7=\"H\",IF(U2_H!AO11=\"\",\"\",U2_H!AO11),\"\")))))))))","v":""},{"$f":"IF($AV$7=\"\",\"\",IF($AV$7=\"A\",IF(U2_A!AP11=\"\",\"\",U2_A!AP11),IF($AV$7=\"B\",IF(U2_B!AP11=\"\",\"\",U2_B!AP11),IF($AV$7=\"C\",IF(U2_C!AP11=\"\",\"\",U2_C!AP11),IF($AV$7=\"D\",IF(U2_D!AP11=\"\",\"\",U2_D!AP11),IF($AV$7=\"E\",IF(U2_E!AP11=\"\",\"\",U2_E!AP11),IF($AV$7=\"F\",IF(U2_F!AP11=\"\",\"\",U2_F!AP11),IF($AV$7=\"G\",IF(U2_G!AP11=\"\",\"\",U2_G!AP11),IF($AV$7=\"H\",IF(U2_H!AP11=\"\",\"\",U2_H!AP11),\"\")))))))))","v":""},{"$f":"IF($AV$7=\"\",\"\",IF($AV$7=\"A\",IF(U2_A!AQ11=\"\",\"\",U2_A!AQ11),IF($AV$7=\"B\",IF(U2_B!AQ11=\"\",\"\",U2_B!AQ11),IF($AV$7=\"C\",IF(U2_C!AQ11=\"\",\"\",U2_C!AQ11),IF($AV$7=\"D\",IF(U2_D!AQ11=\"\",\"\",U2_D!AQ11),IF($AV$7=\"E\",IF(U2_E!AQ11=\"\",\"\",U2_E!AQ11),IF($AV$7=\"F\",IF(U2_F!AQ11=\"\",\"\",U2_F!AQ11),IF($AV$7=\"G\",IF(U2_G!AQ11=\"\",\"\",U2_G!AQ11),IF($AV$7=\"H\",IF(U2_H!AQ11=\"\",\"\",U2_H!AQ11),\"\")))))))))","v":""},{"$f":"IF($AV$7=\"\",\"\",IF($AV$7=\"A\",IF(U2_A!AR11=\"\",\"\",U2_A!AR11),IF($AV$7=\"B\",IF(U2_B!AR11=\"\",\"\",U2_B!AR11),IF($AV$7=\"C\",IF(U2_C!AR11=\"\",\"\",U2_C!AR11),IF($AV$7=\"D\",IF(U2_D!AR11=\"\",\"\",U2_D!AR11),IF($AV$7=\"E\",IF(U2_E!AR11=\"\",\"\",U2_E!AR11),IF($AV$7=\"F\",IF(U2_F!AR11=\"\",\"\",U2_F!AR11),IF($AV$7=\"G\",IF(U2_G!AR11=\"\",\"\",U2_G!AR11),IF($AV$7=\"H\",IF(U2_H!AR11=\"\",\"\",U2_H!AR11),\"\")))))))))","v":""},{"$f":"IF($AV$7=\"\",\"\",IF($AV$7=\"A\",IF(U2_A!AS11=\"\",\"\",U2_A!AS11),IF($AV$7=\"B\",IF(U2_B!AS11=\"\",\"\",U2_B!AS11),IF($AV$7=\"C\",IF(U2_C!AS11=\"\",\"\",U2_C!AS11),IF($AV$7=\"D\",IF(U2_D!AS11=\"\",\"\",U2_D!AS11),IF($AV$7=\"E\",IF(U2_E!AS11=\"\",\"\",U2_E!AS11),IF($AV$7=\"F\",IF(U2_F!AS11=\"\",\"\",U2_F!AS11),IF($AV$7=\"G\",IF(U2_G!AS11=\"\",\"\",U2_G!AS11),IF($AV$7=\"H\",IF(U2_H!AS11=\"\",\"\",U2_H!AS11),\"\")))))))))","v":""},{"$f":"IF($AV$7=\"\",\"\",IF($AV$7=\"A\",IF(U2_A!AT11=\"\",\"\",U2_A!AT11),IF($AV$7=\"B\",IF(U2_B!AT11=\"\",\"\",U2_B!AT11),IF($AV$7=\"C\",IF(U2_C!AT11=\"\",\"\",U2_C!AT11),IF($AV$7=\"D\",IF(U2_D!AT11=\"\",\"\",U2_D!AT11),IF($AV$7=\"E\",IF(U2_E!AT11=\"\",\"\",U2_E!AT11),IF($AV$7=\"F\",IF(U2_F!AT11=\"\",\"\",U2_F!AT11),IF($AV$7=\"G\",IF(U2_G!AT11=\"\",\"\",U2_G!AT11),IF($AV$7=\"H\",IF(U2_H!AT11=\"\",\"\",U2_H!AT11),\"\")))))))))","v":""}]
[]
["Données et condition de réalisation."]
[{"$f":"IF($AV$7=\"\",\"\",IF($AV$7=\"A\",IF(U2_A!A14=\"\",\"\",U2_A!A14),IF($AV$7=\"B\",IF(U2_B!A14=\"\",\"\",U2_B!A14),IF($AV$7=\"C\",IF(U2_C!A14=\"\",\"\",U2_C!A14),IF($AV$7=\"D\",IF(U2_D!A14=\"\",\"\",U2_D!A14),IF($AV$7=\"E\",IF(U2_E!A14=\"\",\"\",U2_E!A14),IF($AV$7=\"F\",IF(U2_F!A14=\"\",\"\",U2_F!A14),IF($AV$7=\"G\",IF(U2_G!A14=\"\",\"\",U2_G!A14),IF($AV$7=\"H\",IF(U2_H!A14=\"\",\"\",U2_H!A14),\"\")))))))))","v":""},"Le dossier technique du bien sur supports papiers ou supports numériques",null,null,null,null,null,null,null,null,null,null,null,null,null,null,null,null,null,null,null,null,null,{"$f":"IF($AV$7=\"\",\"\",IF($AV$7=\"A\",IF(U2_A!X14=\"\",\"\",U2_A!X14),IF($AV$7=\"B\",IF(U2_B!X14=\"\",\"\",U2_B!X14),IF($AV$7=\"C\",IF(U2_C!X14=\"\",\"\",U2_C!X14),IF($AV$7=\"D\",IF(U2_D!X14=\"\",\"\",U2_D!X14),IF($AV$7=\"E\",IF(U2_E!X14=\"\",\"\",U2_E!X14),IF($AV$7=\"F\",IF(U2_F!X14=\"\",\"\",U2_F!X14),IF($AV$7=\"G\",IF(U2_G!X14=\"\",\"\",U2_G!X14),IF($AV$7=\"H\",IF(U2_H!X14=\"\",\"\",U2_H!X14),\"\")))))))))","v":""},"Le cahier des charges fonctionnel"]
[{"$f":"IF($AV$7=\"\",\"\",IF($AV$7=\"A\",IF(U2_A!A15=\"\",\"\",U2_A!A15),IF($AV$7=\"B\",IF(U2_B!A15=\"\",\"\",U2_B!A15),IF($AV$7=\"C\",IF(U2_C!A15=\"\",\"\",U2_C!A15),IF($AV$7=\"D\",IF(U2_D!A15=\"\",\"\",U2_D!A15),IF($AV$7=\"E\",IF(U2_E!A15=\"\",\"\",U2_E!A15),IF($AV$7=\"F\",IF(U2_F!A15=\"\",\"\",U2_F!A15),IF($AV$7=\"G\",IF(U2_G!A15=\"\",\"\",U2_G!A15),IF($AV$7=\"H\",IF(U2_H!A15=\"\",\"\",U2_H!A15),\"\")))))))))","v":""},"Le bien et les conditions de son environnement",null,null,null,null,null,null,null,null,null,null,null,null,null,null,null,null,null,null,null,null,null,{"$f":"IF($AV$7=\"\",\"\",IF($AV$7=\"A\",IF(U2_A!X15=\"\",\"\",U2_A!X15),IF($AV$7=\"B\",IF(U2_B!X15=\"\",\"\",U2_B!X15),IF($AV$7=\"C\",IF(U2_C!X15=\"\",\"\",U2_C!X15),IF($AV$7=\"D\",IF(U2_D!X15=\"\",\"\",U2_D!X15),IF($AV$7=\"E\",IF(U2_E!X15=\"\",\"\",U2_E!X15),IF($AV$7=\"F\",IF(U2_F!X15=\"\",\"\",U2_F!X15),IF($AV$7=\"G\",IF(U2_G!X15=\"\",\"\",U2_G!X15),IF($AV$7=\"H\",IF(U2_H!X15=\"\",\"\",U2_H!X15),\"\")))))))))","v":""},"L’équipement informatique"]
[{"$f":"IF($AV$7=\"\",\"\",IF($AV$7=\"A\",IF(U2_A!A16=\"\",\"\",U2_A!A16),IF($AV$7=\"B\",IF(U2_B!A16=\"\",\"\",U2_B!A16),IF($AV$7=\"C\",IF(U2_C!A16=\"\",\"\",U2_C!A16),IF($AV$7=\"D\",IF(U2_D!A16=\"\",\"\",U2_D!A16),IF($AV$7=\"E\",IF(U2_E!A16=\"\",\"\",U2_E!A16),IF($AV$7=\"F\",IF(U2_F!A16=\"\",\"\",U2_F!A16),IF($AV$7=\"G\",IF(U2_G!A16=\"\",\"\",U2_G!A16),IF($AV$7=\"H\",IF(U2_H!A16=\"\",\"\",U2_H!A16),\"\")))))))))","v":""},"Les normes",null,null,null,null,null,null,null,null,null,null,null,null,null,null,null,null,null,null,null,null,null,{"$f":"IF($AV$7=\"\",\"\",IF($AV$7=\"A\",IF(U2_A!X16=\"\",\"\",U2_A!X16),IF($AV$7=\"B\",IF(U2_B!X16=\"\",\"\",U2_B!X16),IF($AV$7=\"C\",IF(U2_C!X16=\"\",\"\",U2_C!X16),IF($AV$7=\"D\",IF(U2_D!X16=\"\",\"\",U2_D!X16),IF($AV$7=\"E\",IF(U2_E!X16=\"\",\"\",U2_E!X16),IF($AV$7=\"F\",IF(U2_F!X16=\"\",\"\",U2_F!X16),IF($AV$7=\"G\",IF(U2_G!X16=\"\",\"\",U2_G!X16),IF($AV$7=\"H\",IF(U2_H!X16=\"\",\"\",U2_H!X16),\"\")))))))))","v":""},"Les logiciels"]
[{"$f":"IF($AV$7=\"\",\"\",IF($AV$7=\"A\",IF(U2_A!A17=\"\",\"\",U2_A!A17),IF($AV$7=\"B\",IF(U2_B!A17=\"\",\"\",U2_B!A17),IF($AV$7=\"C\",IF(U2_C!A17=\"\",\"\",U2_C!A17),IF($AV$7=\"D\",IF(U2_D!A17=\"\",\"\",U2_D!A17),IF($AV$7=\"E\",IF(U2_E!A17=\"\",\"\",U2_E!A17),IF($AV$7=\"F\",IF(U2_F!A17=\"\",\"\",U2_F!A17),IF($AV$7=\"G\",IF(U2_G!A17=\"\",\"\",U2_G!A17),IF($AV$7=\"H\",IF(U2_H!A17=\"\",\"\",U2_H!A17),\"\")))))))))","v":""},"Toutes documentations techniques",null,null,null,null,null,null,null,null,null,null,null,null,null,null,null,null,null,null,null,null,null,{"$f":"IF($AV$7=\"\",\"\",IF($AV$7=\"A\",IF(U2_A!X17=\"\",\"\",U2_A!X17),IF($AV$7=\"B\",IF(U2_B!X17=\"\",\"\",U2_B!X17),IF($AV$7=\"C\",IF(U2_C!X17=\"\",\"\",U2_C!X17),IF($AV$7=\"D\",IF(U2_D!X17=\"\",\"\",U2_D!X17),IF($AV$7=\"E\",IF(U2_E!X17=\"\",\"\",U2_E!X17),IF($AV$7=\"F\",IF(U2_F!X17=\"\",\"\",U2_F!X17),IF($AV$7=\"G\",IF(U2_G!X17=\"\",\"\",U2_G!X17),IF($AV$7=\"H\",IF(U2_H!X17=\"\",\"\",U2_H!X17),\"\")))))))))","v":""},"Le plan de prévention"]
[{"$f":"IF($AV$7=\"\",\"\",IF($AV$7=\"A\",IF(U2_A!A18=\"\",\"\",U2_A!A18),IF($AV$7=\"B\",IF(U2_B!A18=\"\",\"\",U2_B!A18),IF($AV$7=\"C\",IF(U2_C!A18=\"\",\"\",U2_C!A18),IF($AV$7=\"D\",IF(U2_D!A18=\"\",\"\",U2_D!A18),IF($AV$7=\"E\",IF(U2_E!A18=\"\",\"\",U2_E!A18),IF($AV$7=\"F\",IF(U2_F!A18=\"\",\"\",U2_F!A18),IF($AV$7=\"G\",IF(U2_G!A18=\"\",\"\",U2_G!A18),IF($AV$7=\"H\",IF(U2_H!A18=\"\",\"\",U2_H!A18),\"\")))))))))","v":""},"Le document unique d’évaluation des risques",null,null,null,null,null,null,null,null,null,null,null,null,null,null,null,null,null,null,null,null,null,{"$f":"IF($AV$7=\"\",\"\",IF($AV$7=\"A\",IF(U2_A!X18=\"\",\"\",U2_A!X18),IF($AV$7=\"B\",IF(U2_B!X18=\"\",\"\",U2_B!X18),IF($AV$7=\"C\",IF(U2_C!X18=\"\",\"\",U2_C!X18),IF($AV$7=\"D\",IF(U2_D!X18=\"\",\"\",U2_D!X18),IF($AV$7=\"E\",IF(U2_E!X18=\"\",\"\",U2_E!X18),IF($AV$7=\"F\",IF(U2_F!X18=\"\",\"\",U2_F!X18),IF($AV$7=\"G\",IF(U2_G!X18=\"\",\"\",U2_G!X18),IF($AV$7=\"H\",IF(U2_H!X18=\"\",\"\",U2_H!X18),\"\")))))))))","v":""},"Les outils descripteurs (grafcet, chronogramme…)"]
[{"$f":"IF($AV$7=\"\",\"\",IF($AV$7=\"A\",IF(U2_A!A19=\"\",\"\",U2_A!A19),IF($AV$7=\"B\",IF(U2_B!A19=\"\",\"\",U2_B!A19),IF($AV$7=\"C\",IF(U2_C!A19=\"\",\"\",U2_C!A19),IF($AV$7=\"D\",IF(U2_D!A19=\"\",\"\",U2_D!A19),IF($AV$7=\"E\",IF(U2_E!A19=\"\",\"\",U2_E!A19),IF($AV$7=\"F\",IF(U2_F!A19=\"\",\"\",U2_F!A19),IF($AV$7=\"G\",IF(U2_G!A19=\"\",\"\",U2_G!A19),IF($AV$7=\"H\",IF(U2_H!A19=\"\",\"\",U2_H!A19),\"\")))))))))","v":""},"Toutes informations en provenance de l’utilisateur",null,null,null,null,null,null,null,null,null,null,null,null,null,null,null,null,null,null,null,null,null,{"$f":"IF($AV$7=\"\",\"\",IF($AV$7=\"A\",IF(U2_A!X19=\"\",\"\",U2_A!X19),IF($AV$7=\"B\",IF(U2_B!X19=\"\",\"\",U2_B!X19),IF($AV$7=\"C\",IF(U2_C!X19=\"\",\"\",U2_C!X19),IF($AV$7=\"D\",IF(U2_D!X19=\"\",\"\",U2_D!X19),IF($AV$7=\"E\",IF(U2_E!X19=\"\",\"\",U2_E!X19),IF($AV$7=\"F\",IF(U2_F!X19=\"\",\"\",U2_F!X19),IF($AV$7=\"G\",IF(U2_G!X19=\"\",\"\",U2_G!X19),IF($AV$7=\"H\",IF(U2_H!X19=\"\",\"\",U2_H!X19),\"\")))))))))","v":""},"Le constat de défaillance."]
[{"$f":"IF($AV$7=\"\",\"\",IF($AV$7=\"A\",IF(U2_A!A20=\"\",\"\",U2_A!A20),IF($AV$7=\"B\",IF(U2_B!A20=\"\",\"\",U2_B!A20),IF($AV$7=\"C\",IF(U2_C!A20=\"\",\"\",U2_C!A20),IF($AV$7=\"D\",IF(U2_D!A20=\"\",\"\",U2_D!A20),IF($AV$7=\"E\",IF(U2_E!A20=\"\",\"\",U2_E!A20),IF($AV$7=\"F\",IF(U2_F!A20=\"\",\"\",U2_F!A20),IF($AV$7=\"G\",IF(U2_G!A20=\"\",\"\",U2_G!A20),IF($AV$7=\"H\",IF(U2_H!A20=\"\",\"\",U2_H!A20),\"\")))))))))","v":""},"Les contraintes dans l’environnement",null,null,null,null,null,null,null,null,null,null,null,null,null,null,null,null,null,null,null,null,null,{"$f":"IF($AV$7=\"\",\"\",IF($AV$7=\"A\",IF(U2_A!X20=\"\",\"\",U2_A!X20),IF($AV$7=\"B\",IF(U2_B!X20=\"\",\"\",U2_B!X20),IF($AV$7=\"C\",IF(U2_C!X20=\"\",\"\",U2_C!X20),IF($AV$7=\"D\",IF(U2_D!X20=\"\",\"\",U2_D!X20),IF($AV$7=\"E\",IF(U2_E!X20=\"\",\"\",U2_E!X20),IF($AV$7=\"F\",IF(U2_F!X20=\"\",\"\",U2_F!X20),IF($AV$7=\"G\",IF(U2_G!X20=\"\",\"\",U2_G!X20),IF($AV$7=\"H\",IF(U2_H!X20=\"\",\"\",U2_H!X20),\"\")))))))))","v":""},"Les impératifs de production."]
[{"$f":"IF($AV$7=\"\",\"\",IF($AV$7=\"A\",IF(U2_A!A21=\"\",\"\",U2_A!A21),IF($AV$7=\"B\",IF(U2_B!A21=\"\",\"\",U2_B!A21),IF($AV$7=\"C\",IF(U2_C!A21=\"\",\"\",U2_C!A21),IF($AV$7=\"D\",IF(U2_D!A21=\"\",\"\",U2_D!A21),IF($AV$7=\"E\",IF(U2_E!A21=\"\",\"\",U2_E!A21),IF($AV$7=\"F\",IF(U2_F!A21=\"\",\"\",U2_F!A21),IF($AV$7=\"G\",IF(U2_G!A21=\"\",\"\",U2_G!A21),IF($AV$7=\"H\",IF(U2_H!A21=\"\",\"\",U2_H!A21),\"\")))))))))","v":""},"Les délais d’interventions",null,null,null,null,null,null,null,null,null,null,null,null,null,null,null,null,null,null,null,null,null,{"$f":"IF($AV$7=\"\",\"\",IF($AV$7=\"A\",IF(U2_A!X21=\"\",\"\",U2_A!X21),IF($AV$7=\"B\",IF(U2_B!X21=\"\",\"\",U2_B!X21),IF($AV$7=\"C\",IF(U2_C!X21=\"\",\"\",U2_C!X21),IF($AV$7=\"D\",IF(U2_D!X21=\"\",\"\",U2_D!X21),IF($AV$7=\"E\",IF(U2_E!X21=\"\",\"\",U2_E!X21),IF($AV$7=\"F\",IF(U2_F!X21=\"\",\"\",U2_F!X21),IF($AV$7=\"G\",IF(U2_G!X21=\"\",\"\",U2_G!X21),IF($AV$7=\"H\",IF(U2_H!X21=\"\",\"\",U2_H!X21),\"\")))))))))","v":""},"Toutes documentations techniques"]
[{"$f":"IF($AV$7=\"\",\"\",IF($AV$7=\"A\",IF(U2_A!A22=\"\",\"\",U2_A!A22),IF($AV$7=\"B\",IF(U2_B!A22=\"\",\"\",U2_B!A22),IF($AV$7=\"C\",IF(U2_C!A22=\"\",\"\",U2_C!A22),IF($AV$7=\"D\",IF(U2_D!A22=\"\",\"\",U2_D!A22),IF($AV$7=\"E\",IF(U2_E!A22=\"\",\"\",U2_E!A22),IF($AV$7=\"F\",IF(U2_F!A22=\"\",\"\",U2_F!A22),IF($AV$7=\"G\",IF(U2_G!A22=\"\",\"\",U2_G!A22),IF($AV$7=\"H\",IF(U2_H!A22=\"\",\"\",U2_H!A22),\"\")))))))))","v":""},"Un groupe de travail.",null,null,null,null,null,null,null,null,null,null,null,null,null,null,null,null,null,null,null,null,null,{"$f":"IF($AV$7=\"\",\"\",IF($AV$7=\"A\",IF(U2_A!X22=\"\",\"\",U2_A!X22),IF($AV$7=\"B\",IF(U2_B!X22=\"\",\"\",U2_B!X22),IF($AV$7=\"C\",IF(U2_C!X22=\"\",\"\",U2_C!X22),IF($AV$7=\"D\",IF(U2_D!X22=\"\",\"\",U2_D!X22),IF($AV$7=\"E\",IF(U2_E!X22=\"\",\"\",U2_E!X22),IF($AV$7=\"F\",IF(U2_F!X22=\"\",\"\",U2_F!X22),IF($AV$7=\"G\",IF(U2_G!X22=\"\",\"\",U2_G!X22),IF($AV$7=\"H\",IF(U2_H!X22=\"\",\"\",U2_H!X22),\"\")))))))))","v":""},"Les moyens de communication"]
[{"$f":"IF($AV$7=\"\",\"\",IF($AV$7=\"A\",IF(U2_A!A23=\"\",\"\",U2_A!A23),IF($AV$7=\"B\",IF(U2_B!A23=\"\",\"\",U2_B!A23),IF($AV$7=\"C\",IF(U2_C!A23=\"\",\"\",U2_C!A23),IF($AV$7=\"D\",IF(U2_D!A23=\"\",\"\",U2_D!A23),IF($AV$7=\"E\",IF(U2_E!A23=\"\",\"\",U2_E!A23),IF($AV$7=\"F\",IF(U2_F!A23=\"\",\"\",U2_F!A23),IF($AV$7=\"G\",IF(U2_G!A23=\"\",\"\",U2_G!A23),IF($AV$7=\"H\",IF(U2_H!A23=\"\",\"\",U2_H!A23),\"\")))))))))","v":""},"La fiche de procédures",null,null,null,null,null,null,null,null,null,null,null,null,null,null,null,null,null,null,null,null,null,{"$f":"IF($AV$7=\"\",\"\",IF($AV$7=\"A\",IF(U2_A!X23=\"\",\"\",U2_A!X23),IF($AV$7=\"B\",IF(U2_B!X23=\"\",\"\",U2_B!X23),IF($AV$7=\"C\",IF(U2_C!X23=\"\",\"\",U2_C!X23),IF($AV$7=\"D\",IF(U2_D!X23=\"\",\"\",U2_D!X23),IF($AV$7=\"E\",IF(U2_E!X23=\"\",\"\",U2_E!X23),IF($AV$7=\"F\",IF(U2_F!X23=\"\",\"\",U2_F!X23),IF($AV$7=\"G\",IF(U2_G!X23=\"\",\"\",U2_G!X23),IF($AV$7=\"H\",IF(U2_H!X23=\"\",\"\",U2_H!X23),\"\")))))))))","v":""},"La demande d’intervention ou le bon de travail."]
["     ÇRepérer les données fournies",null,null,null,null,null,null,null,null,null,null,null,null,null,null,null,null,null,null,null,null,null,null,null,"ÇRepérer les données fournies"]
["Travail demandé"]
[{"$f":"IF($AV$7=\"\",\"\",IF($AV$7=\"A\",IF(U2_A!A26=\"\",\"\",U2_A!A26),IF($AV$7=\"B\",IF(U2_B!A26=\"\",\"\",U2_B!A26),IF($AV$7=\"C\",IF(U2_C!A26=\"\",\"\",U2_C!A26),IF($AV$7=\"D\",IF(U2_D!A26=\"\",\"\",U2_D!A26),IF($AV$7=\"E\",IF(U2_E!A26=\"\",\"\",U2_E!A26),IF($AV$7=\"F\",IF(U2_F!A26=\"\",\"\",U2_F!A26),IF($AV$7=\"G\",IF(U2_G!A26=\"\",\"\",U2_G!A26),IF($AV$7=\"H\",IF(U2_H!A26=\"\",\"\",U2_H!A26),\"\")))))))))","v":""},"A1-T1",null,"Réaliser la maintenance corrective - Diagnostiquer les pannes."]
[{"$f":"IF($AV$7=\"\",\"\",IF($AV$7=\"A\",IF(U2_A!A27=\"\",\"\",U2_A!A27),IF($AV$7=\"B\",IF(U2_B!A27=\"\",\"\",U2_B!A27),IF($AV$7=\"C\",IF(U2_C!A27=\"\",\"\",U2_C!A27),IF($AV$7=\"D\",IF(U2_D!A27=\"\",\"\",U2_D!A27),IF($AV$7=\"E\",IF(U2_E!A27=\"\",\"\",U2_E!A27),IF($AV$7=\"F\",IF(U2_F!A27=\"\",\"\",U2_F!A27),IF($AV$7=\"G\",IF(U2_G!A27=\"\",\"\",U2_G!A27),IF($AV$7=\"H\",IF(U2_H!A27=\"\",\"\",U2_H!A27),\"\")))))))))","v":""},"A1-T2",null,"Réaliser la maintenance corrective - Préparer sa réparation, son dépannage. "]
[{"$f":"IF($AV$7=\"\",\"\",IF($AV$7=\"A\",IF(U2_A!A28=\"\",\"\",U2_A!A28),IF($AV$7=\"B\",IF(U2_B!A28=\"\",\"\",U2_B!A28),IF($AV$7=\"C\",IF(U2_C!A28=\"\",\"\",U2_C!A28),IF($AV$7=\"D\",IF(U2_D!A28=\"\",\"\",U2_D!A28),IF($AV$7=\"E\",IF(U2_E!A28=\"\",\"\",U2_E!A28),IF($AV$7=\"F\",IF(U2_F!A28=\"\",\"\",U2_F!A28),IF($AV$7=\"G\",IF(U2_G!A28=\"\",\"\",U2_G!A28),IF($AV$7=\"H\",IF(U2_H!A28=\"\",\"\",U2_H!A28),\"\")))))))))","v":""},"A1-T3",null,"Réaliser la maintenance corrective - Réaliser des réparations, des dépannages dans les domaines : mécanique, électrique, pneumatique, hydraulique."]
[{"$f":"IF($AV$7=\"\",\"\",IF($AV$7=\"A\",IF(U2_A!A29=\"\",\"\",U2_A!A29),IF($AV$7=\"B\",IF(U2_B!A29=\"\",\"\",U2_B!A29),IF($AV$7=\"C\",IF(U2_C!A29=\"\",\"\",U2_C!A29),IF($AV$7=\"D\",IF(U2_D!A29=\"\",\"\",U2_D!A29),IF($AV$7=\"E\",IF(U2_E!A29=\"\",\"\",U2_E!A29),IF($AV$7=\"F\",IF(U2_F!A29=\"\",\"\",U2_F!A29),IF($AV$7=\"G\",IF(U2_G!A29=\"\",\"\",U2_G!A29),IF($AV$7=\"H\",IF(U2_H!A29=\"\",\"\",U2_H!A29),\"\")))))))))","v":""},"A3-T1",null,"Mettre en œuvre des améliorations, des modifications - Proposer des améliorations ou des modifications"]
[{"$f":"IF($AV$7=\"\",\"\",IF($AV$7=\"A\",IF(U2_A!A30=\"\",\"\",U2_A!A30),IF($AV$7=\"B\",IF(U2_B!A30=\"\",\"\",U2_B!A30),IF($AV$7=\"C\",IF(U2_C!A30=\"\",\"\",U2_C!A30),IF($AV$7=\"D\",IF(U2_D!A30=\"\",\"\",U2_D!A30),IF($AV$7=\"E\",IF(U2_E!A30=\"\",\"\",U2_E!A30),IF($AV$7=\"F\",IF(U2_F!A30=\"\",\"\",U2_F!A30),IF($AV$7=\"G\",IF(U2_G!A30=\"\",\"\",U2_G!A30),IF($AV$7=\"H\",IF(U2_H!A30=\"\",\"\",U2_H!A30),\"\")))))))))","v":""},"A3-T2",null,"Mettre en œuvre des améliorations, des modifications - Préparer et réaliser l’amélioration ou la modification"]
["Consulter le référentiel des activités professionnelles pour obtenir le détail des tâches."]
["Ç Repérer les tâches demandées (ce sont celles qui correspondent à l’unité dans le référentiel de certification, à l’exclusion de toute autre)"]
["Appréciation globale et proposition de note : "]
[]
["Noms et signatures des évaluateurs :\n\n\n",null,null,null,null,null,null,null,null,null,null,null,null,null,null,null,null,null,null,null,null,null,null,null,null,null,null,null,null,null,null,null,null,null,null,"Note proposée :          ",null,null,null,null,{"$f":"IF(AI127=\"\",\"\",AI127)","v":""},null,null,"/20"]
[null,null,null,null,null,null,null,null,null,null,null,null,null,null,null,null,null,null,null,null,null,null,null,null,null,null,null,null,null,null,null,null,null,null,null,"Note affectée de son coefficient :",null,null,null,null,{"$f":"IF(AO35=\"\",\"\",AO35*4)","v":""},null,null,"/80"]
["Baccalauréat professionnel « maintenance des équipements industriels »  – Unité U 2",null,null,null,null,null,null,null,null,null,null,null,null,null,null,null,null,null,null,null,null,null,null,null,null,null,null,null,null,null,null,null,null,null,"Validé",null,null,null,"-       Synthèse    +"]
[]
["CP 2.3 : Analyser les solutions de gestion, de distribution, de conversion des énergies pneumatique hydraulique et électrique.",null,null,null,null,null,null,null,null,null,null,null,null,null,null,null,null,null,null,null,null,null,null,null,null,null,null,null,null,null,"Evalué",null,null,null,{"$f":"IF(AE39=\"Non Evalué\",\"NE\",IF(AE39=\"Evalué\",\"E\",\"\"))","v":"E"},{"$f":"COUNTIF(AI41:AL58,\"Validé\")","v":0},{"$f":"COUNTIF(AI41:AL58,\"Non Validé\")","v":0},{"$f":"COUNTIF(AI41:AL58,\"Non Evalué\")","v":0},null,null,null,null,null,null,null,null,null,{"$f":"IF(AE39=\"\",\"Souhaitez-vous évaluer la compétence ?\",IF(AND(AE39=\"Non Evalué\",OR(AJ39<>0,AK39<>0)),\"Vous avez choisi de ne pas évaluer la compétence. Ne rien indiquez dans la colonne Validé.\",IF(AND(AE39=\"Evalué\",OR(AI41=\"\",AI43=\"\",AI45=\"\",AI47=\"\",AI49=\"\",AI51=\"\",AI53=\"\",AI55=\"\",AI57=\"\")),\"Vous avez choisi d'évaluer la compétence. Indiquez pour chaques actions : Validé, Non Validé ou Non Evalué.\",IF(OR(AE39=\"Non Evalué\",(AJ39+AK39)=0),\"\",CONCATENATE(ROUND((100*AJ40/(AJ40+AK40)),0),\" % d'actions validées. \",AJ39,\" validée(s) sur \",AJ39+AK39,\" . Conseil: Au maximum , grisez \",ROUND((100*AJ40/(AJ40+AK40))*8/100,0),\" colonnes\")))))","v":"Vous avez choisi d'évaluer la compétence. Indiquez pour chaques actions : Validé, Non Validé ou Non Evalué."}]
[null,null,null,null,null,null,null,null,null,null,null,null,null,null,null,null,null,null,null,null,null,null,null,null,null,null,null,null,null,null,null,null,null,null,null,{"$f":"SUMPRODUCT((AI41:AL58=\"Validé\")*(Bareme!AE63:AE80))","v":0},{"$f":"SUMPRODUCT((AI41:AL58=\"Non Validé\")*(Bareme!AE63:AE80))","v":0}]
[1,null,"Décoder toutes formes de représentation des circuits de distribution des énergies.",null,null,null,null,null,null,null,null,null,null,"Les représentations sont lues et comprises sans erreur.",null,null,null,null,null,null,null,null,null,null,null,null,null,null,null,null,null,null,null,null,null,null,null,null,null,null,null,null,null,null,null,null,null,0]
[]
[2,null,"Identifier les matériels qui concourent à assurer la protection des personnes et des biens.",null,null,null,null,null,null,null,null,null,null,"Les matériels qui concourent à assurer la protection des personnes et des biens sont localisés, reconnus et nommés.\nLe régime de neutre de l’installation est identifié."]
[]
[3,null,"Identifier et désigner pour chaque solution technique (gestion, traitement, distribution, protection, conversion) :\n• les composants utilisés,\n• les performances attendues ou constatées,\n• les caractéristiques,\n• les conditions d’utilisations,\n• les risques de défaillances",null,null,null,null,null,null,null,null,null,null,"Les composants constitutifs des solutions techniques et leurs éléments d’assemblage sont identifiés et désignés exhaustivement et sans erreur."]
[]
[null,null,null,null,null,null,null,null,null,null,null,null,null,"Les caractéristiques, les performances, les conditions d’utilisations, les risques de défaillances sont listés."]
[]
[null,null,null,null,null,null,null,null,null,null,null,null,null,"Les dérives de fonctionnement sont justifiées."]
[]
[null,null,null,null,null,null,null,null,null,null,null,null,null,"Les risques de défaillances sont listés et décrits."]
[]
[4,null,"Décrire d’un point de vue temporel :\n• l’évolution des niveaux d’énergie\n• les comportements des différents composants.\n",null,null,null,null,null,null,null,null,null,null,"Les outils descripteurs sont maîtrisés"]
[]
[null,null,null,null,null,null,null,null,null,null,null,null,null,"La description temporelle représente fidèlement des paramètres des énergies et le fonctionnement des composants."]
[null,null,null,null,null,null,null,null,null,null,null,null,null,null,null,null,null,null,null,null,null,null,null,null,null,null,null,null,null,null,null,null,null,null,null,null,null,null,"Commentaires:\n"]
[5,null,"Décrire et valider par le calcul les niveaux d’énergie associés aux solutions techniques à assurer.",null,null,null,null,null,null,null,null,null,null,"Les paramètres (débit, pression, intensité…) sont vérifiés."]
[]
["CP 3.1 : Préparer son intervention.",null,null,null,null,null,null,null,null,null,null,null,null,null,null,null,null,null,null,null,null,null,null,null,null,null,null,null,null,null,"Evalué",null,null,null,{"$f":"IF(AE59=\"Non Evalué\",\"NE\",IF(AE59=\"Evalué\",\"E\",\"\"))","v":"E"},{"$f":"COUNTIF(AI61:AL82,\"Validé\")","v":0},{"$f":"COUNTIF(AI61:AL82,\"Non Validé\")","v":0},{"$f":"COUNTIF(AI61:AL82,\"Non Evalué\")","v":0},null,null,null,null,null,null,null,null,null,{"$f":"IF(AE59=\"\",\"Souhaitez-vous évaluer la compétence ?\",IF(AND(AE59=\"Non Evalué\",OR(AJ59<>0,AK59<>0)),\"Vous avez choisi de ne pas évaluer la compétence. Ne rien indiquez dans la colonne Validé.\",IF(AND(AE59=\"Evalué\",OR(AI61=\"\",AI63=\"\",AI65=\"\",AI67=\"\",AI69=\"\",AI71=\"\",AI73=\"\",AI75=\"\",AI77=\"\",AI79=\"\",AI81=\"\")),\"Vous avez choisi d'évaluer la compétence. Indiquez pour chaques actions : Validé, Non Validé ou Non Evalué.\",IF(OR(AE59=\"Non Evalué\",(AJ59+AK59)=0),\"\",CONCATENATE(ROUND((100*AJ60/(AJ60+AK60)),0),\" % d'actions validées. \",AJ59,\" validée(s) sur \",AJ59+AK59,\" . Conseil: Au maximum , grisez \",ROUND((100*AJ60/(AJ60+AK60))*8/100,0),\" colonnes\")))))","v":"Vous avez choisi d'évaluer la compétence. Indiquez pour chaques actions : Validé, Non Validé ou Non Evalué."}]
[null,null,null,null,null,null,null,null,null,null,null,null,null,null,null,null,null,null,null,null,null,null,null,null,null,null,null,null,null,null,null,null,null,null,null,{"$f":"SUMPRODUCT((AI61:AL82=\"Validé\")*(Bareme!AE83:AE104))","v":0},{"$f":"SUMPRODUCT((AI61:AL82=\"Non Validé\")*(Bareme!AE83:AE104))","v":0}]
[1,null,"Prendre connaissance de la demande d’intervention.",null,null,null,null,null,null,null,null,null,null,"Les indications portées sur la demande d’intervention et au plan de prévention sont identifiées et assimilées (comprises).",null,null,null,null,null,null,null,null,null,null,null,null,null,null,null,null,null,null,null,null,null,null,null,null,null,null,null,null,null,null,null,null,null,0]
[]
[2,null,"Collecter les documents nécessaires à l’intervention.",null,null,null,null,null,null,null,null,null,null,"Les documents collectés permettent d’organiser et de réaliser l’intervention."]
[]
[3,null,"Evaluer les difficultés d’accès aux composants",null,null,null,null,null,null,null,null,null,null,"Les contraintes d’accès sont repérées et énumérées."]
[]
[4,null,"Situer le ou les dispositifs de sécurité interne ou externe du bien.",null,null,null,null,null,null,null,null,null,null,"Les dispositifs de sécurités sont convenablement localisés."]
[]
[5,null,"Identifier les risques de son intervention",null,null,null,null,null,null,null,null,null,null,"Les risques sont bien repérés"]
[]
[6,null,"Recenser les moyens de protections individuels et collectifs.",null,null,null,null,null,null,null,null,null,null,"Les moyens sont listés exhaustivement."]
[]
[7,null,"Formuler les modifications à apporter si nécessaire.",null,null,null,null,null,null,null,null,null,null,"Les nouvelles contraintes sont prises en compte."]
[null,null,null,null,null,null,null,null,null,null,null,null,null,null,null,null,null,null,null,null,null,null,null,null,null,null,null,null,null,null,null,null,null,null,null,null,null,null,"Commentaires:\n"]
[8,null,"Analyser ou établir la procédure de son intervention.",null,null,null,null,null,null,null,null,null,null,"La procédure est comprise  ou judicieusement rédigée."]
[]
[9,null,"Evaluer le temps nécessaire et le délai de livraison (mise à disposition après réparation).",null,null,null,null,null,null,null,null,null,null,"La durée de l’intervention prévue est adaptée."]
[]
[10,null,"Planifier son intervention en tenant compte :\n• des impératifs de production,\n• des stocks disponibles,\n• de la durée estimée de son intervention\n",null,null,null,null,null,null,null,null,null,null,"Tous les critères de planification sont respectés."]
[]
[11,null,"Rassembler et inventorier les outils, les appareils de mesures et de contrôles, les moyens de manutention et de sécurité nécessaires.",null,null,null,null,null,null,null,null,null,null,"L’ensemble des moyens est  identifié, vérifié et répertorié."]
[]
["Baccalauréat professionnel « maintenance des équipements industriels »  – Unité U 2",null,null,null,null,null,null,null,null,null,null,null,null,null,null,null,null,null,null,null,null,null,null,null,null,null,null,null,null,null,null,null,null,null,"Validé",null,null,null,"-       Synthèse    +"]
[]
["CP 3.2 : Émettre des propositions d’améliorations d’un bien",null,null,null,null,null,null,null,null,null,null,null,null,null,null,null,null,null,null,null,null,null,null,null,null,null,null,null,null,null,"Evalué",null,null,null,{"$f":"IF(AE85=\"Non Evalué\",\"NE\",IF(AE85=\"Evalué\",\"E\",\"\"))","v":"E"},{"$f":"COUNTIF(AI87:AL108,\"Validé\")","v":0},{"$f":"COUNTIF(AI87:AL108,\"Non Validé\")","v":0},{"$f":"COUNTIF(AI87:AL108,\"Non Evalué\")","v":0},null,null,null,null,null,null,null,null,null,{"$f":"IF(AE85=\"\",\"Souhaitez-vous évaluer la compétence ?\",IF(AND(AE85=\"Non Evalué\",OR(AJ85<>0,AK85<>0)),\"Vous avez choisi de ne pas évaluer la compétence. Ne rien indiquez dans la colonne Validé.\",IF(AND(AE85=\"Evalué\",OR(AI87=\"\",AI89=\"\",AI91=\"\",AI93=\"\",AI95=\"\",AI97=\"\",AI99=\"\",AI101=\"\",AI103=\"\",AI105=\"\",AI107=\"\")),\"Vous avez choisi d'évaluer la compétence. Indiquez pour chaques actions : Validé, Non Validé ou Non Evalué.\",IF(OR(AE85=\"Non Evalué\",(AJ85+AK85)=0),\"\",CONCATENATE(ROUND((100*AJ86/(AJ86+AK86)),0),\" % d'actions validées. \",AJ85,\" validée(s) sur \",AJ85+AK85,\" . Conseil: Au maximum , grisez \",ROUND((100*AJ86/(AJ86+AK86))*8/100,0),\" colonnes\")))))","v":"Vous avez choisi d'évaluer la compétence. Indiquez pour chaques actions : Validé, Non Validé ou Non Evalué."}]
[null,null,null,null,null,null,null,null,null,null,null,null,null,null,null,null,null,null,null,null,null,null,null,null,null,null,null,null,null,null,null,null,null,null,null,{"$f":"SUMPRODUCT((AI87:AL108=\"Validé\")*(Bareme!AE107:AE128))","v":0},{"$f":"SUMPRODUCT((AI87:AL108=\"Non Validé\")*(Bareme!AE107:AE128))","v":0}]
[1,null,"Exploiter l’historique du bien.",null,null,null,null,null,null,null,null,null,null,"Les événements sont analysés.",null,null,null,null,null,null,null,null,null,null,null,null,null,null,null,null,null,null,null,null,null,null,null,null,null,null,null,null,null,null,null,null,null,0]
[]
[null,null,null,null,null,null,null,null,null,null,null,null,null,"Les données liés à la maintenabilité (fiabilité, accessibilité, temps d’intervention…) et à la sécurité, justifiant la proposition de modification, sont repérées."]
[]
[2,null,"Argumenter la proposition d’amélioration au regard des problèmes constatés (maintenabilité, sécurité).",null,null,null,null,null,null,null,null,null,null,"Les justifications orales et écrites sont exploitables et pertinentes.\nLa proposition est justifiée économiquement.",null,null,null,null,null,null,null,null,null,null,null,null,null,null,null,null,null,null,null,null,null,null,null,null,"Commentaires:\n"]
[]
[3,null,"Proposer des solutions d’amélioration d’un point de vue maintenance sur :\n• la partie commande\n• la partie opérative\n• l’environnement\nExemple :\n une nouvelle solution constructive\n un composant de remplacement…\n",null,null,null,null,null,null,null,null,null,null,"La solution ou le composant proposé doit permettre d’améliorer la fiabilité,"]
[]
[null,null,null,null,null,null,null,null,null,null,null,null,null,"La solution ou le composant proposé doit permettre de diminuer le temps d’intervention,"]
[]
[null,null,null,null,null,null,null,null,null,null,null,null,null,"La solution ou le composant proposé doit permettre d’améliorer l’accessibilité,"]
[]
[null,null,null,null,null,null,null,null,null,null,null,null,null,"La solution ou le composant proposé doit permettre de diminuer le coût des pièces de rechanges"]
[]
[null,null,null,null,null,null,null,null,null,null,null,null,null,"La solution ou le composant proposé doit permettre d’améliorer la sécurité."]
[]
[null,null,null,null,null,null,null,null,null,null,null,null,null,"La sécurité est optimisée."]
[]
[4,null,"Produire des documents présentant l’évolution.",null,null,null,null,null,null,null,null,null,null,"Les documents produits sont exploitables et conformes aux normes en vigueur quand ils y font référence."]
[]
[null,null,null,null,null,null,null,null,null,null,null,null,null,"L’évolution du plan de prévention est proposée."]
[]
[]
[]
[]
[]
[]
[]
[]
[]
[]
[]
[]
[]
[]
[]
[]
[null,null,null,null,{"$f":"IF(OR(I135=\"\",AND(AJ39=\"\",AK39=\"\",AJ59=\"\",AK59=\"\",AJ85=\"\",AK85=\"\")=0),\"\",CONCATENATE(\"PROPOSITION: \",CEILING(I135,0.5),\"/20 (\",ROUND(100*COUNTIF(U134:U136,\"E\")/(COUNTIF(U134:U136,\"E\")+COUNTIF(U134:U136,\"NE\")),0),\"% des compétences évaluées).\"))","v":"PROPOSITION: 0/20 (100% des compétences évaluées)."}]
[]
[]
[null,null,null,null,"Proposition des évaluateurs:"]
[]
[]
[]
[null,null,null,null,"Ne pas effacer"]
[null,null,null,null,null,null,null,null,null,null,null,null,null,null,{"$f":"CONCATENATE(\"Statistique U31 de \",$AE$4)","v":{"$error":"#N/A"}}]
[null,null,null,null,null,null,null,null,null,null,null,null,null,null,"Compétences",{"$f":"IF(AE4=\"\",\"\",AE4)","v":{"$error":"#N/A"}},"Satisfaction maximale","Satisfaction moyenne",{"$f":"CONCATENATE(\"Statistique U2 de \",$AE$4)","v":{"$error":"#N/A"}},"Coefficients","Validée ou Non Validée"]
[null,null,"Somme",null,null,null,null,null,{"$f":"SUMPRODUCT((P134:P136))","v":0},null,{"$f":"SUM(Q134:Q136)","v":800},null,null,null,{"$f":"A39","v":"CP 2.3 : Analyser les solutions de gestion, de distribution, de conversion des énergies pneumatique hydraulique et électrique."},{"$f":"IF(OR(U134=\"NE\",U134=\"\"),\"\",S134*T134)","v":0},{"$f":"IF(OR(U134=\"NE\",U134=\"\"),\"\",T134*8)","v":320},{"$f":"IF(OR(U134=\"NE\",U134=\"\"),\"\",Q134/2)","v":160},{"$f":"IF($AV$41=\"\",\"\",$AV$41)","v":0},{"$f":"Bareme!AE61","v":40},{"$f":"IF(AI39=\"\",\"\",AI39)","v":"E"}]
[null,null,"Moyenne /20",null,null,null,null,null,{"$f":"IF($K$134=0,\"\",K135*$I$134/$K$134)","v":0},null,20,null,null,null,{"$f":"A59","v":"CP 3.1 : Préparer son intervention."},{"$f":"IF(OR(U135=\"NE\",U135=\"\"),\"\",S135*T135)","v":0},{"$f":"IF(OR(U135=\"NE\",U135=\"\"),\"\",T135*8)","v":240},{"$f":"IF(OR(U135=\"NE\",U135=\"\"),\"\",Q135/2)","v":120},{"$f":"IF($AV$61=\"\",\"\",$AV$61)","v":0},{"$f":"Bareme!AE81","v":30},{"$f":"IF(AI59=\"\",\"\",AI59)","v":"E"}]
[null,null,"Moyenne /80",null,null,null,null,null,{"$f":"IF($K$134=0,\"\",K136*$I$134/$K$134)","v":0},null,80,null,null,null,{"$f":"A85","v":"CP 3.2 : Émettre des propositions d’améliorations d’un bien"},{"$f":"IF(OR(U136=\"NE\",U136=\"\"),\"\",S136*T136)","v":0},{"$f":"IF(OR(U136=\"NE\",U136=\"\"),\"\",T136*8)","v":240},{"$f":"IF(OR(U136=\"NE\",U136=\"\"),\"\",Q136/2)","v":120},{"$f":"IF($AV$87=\"\",\"\",$AV$87)","v":0},{"$f":"Bareme!AE105","v":30},{"$f":"IF(AI85=\"\",\"\",AI85)","v":"E"}]
[null,null,null,null,"Ne pas effacer"]

{"sheet":"U31","index":6,"n_rows":197,"n_cols":48,"rows_kept":197,"cut":false,"hidden":true,"merged":[[32,3,32,45],[33,3,33,45],[34,3,34,45],[18,24,18,45],[19,24,19,45],[18,1,18,22],[19,1,19,22],[20,1,20,22],[21,1,21,22],[22,1,22,22],[22,24,22,45],[23,24,23,45],[32,1,32,2],[25,24,25,45],[27,0,27,45],[28,1,28,2],[29,1,29,2],[30,1,30,2],[28,3,28,45],[29,3,29,45],[30,3,30,45],[31,3,31,45],[33,1,33,2],[34,1,34,2],[0,0,0,45],[1,0,1,45],[3,0,5,22],[2,0,2,22],[2,23,2,29],[3,23,3,29],[4,23,4,29],[5,23,5,29],[2,30,2,45],[5,30,5,45],[3,30,4,45],[6,0,6,45],[7,0,7,45],[8,0,8,45],[15,1,15,22],[16,1,16,22],[17,1,17,22],[23,1,23,22],[31,1,31,2],[24,1,24,22],[25,1,25,22],[9,0,9,45],[10,0,10,45],[12,0,12,45],[13,1,13,22],[14,1,14,22],[13,24,13,45],[14,24,14,45],[20,24,20,45],[21,24,21,45],[24,24,24,45],[15,24,15,45],[16,24,16,45],[17,24,17,45],[180,4,182,39],[183,34,185,39],[183,4,185,33],[188,14,188,27],[35,0,35,45],[39,43,39,45],[40,43,40,45],[39,40,39,42],[40,40,40,42],[37,0,37,45],[38,0,38,45],[39,35,39,39],[40,35,40,39],[39,0,40,34],[68,0,73,1],[42,0,43,33],[42,34,43,37],[42,38,42,45],[43,38,43,45],[41,0,41,45],[52,13,53,33],[52,34,53,37],[54,13,55,33],[54,34,55,37],[44,47,45,49],[46,13,47,33],[46,34,47,37],[48,13,49,33],[48,34,49,37],[50,13,51,33],[50,34,51,37],[44,0,45,29],[44,30,45,33],[46,2,47,12],[48,2,51,12],[46,0,47,1],[48,0,51,1],[62,0,63,29],[62,30,63,33],[62,47,63,49],[64,13,65,33],[64,34,65,37],[66,13,67,33],[66,34,67,37],[64,0,67,1],[56,13,57,33],[56,34,57,37],[58,13,59,33],[58,34,59,37],[60,13,61,33],[60,34,61,37],[52,2,57,12],[58,2,59,12],[60,2,61,12],[52,0,57,1],[58,0,59,1],[60,0,61,1],[68,13,69,33],[68,34,69,37],[70,13,71,33],[70,34,71,37],[72,13,73,33],[72,34,73,37],[88,13,89,33],[88,34,89,37],[90,13,91,33],[90,34,91,37],[78,34,79,37],[80,13,81,33],[80,34,81,37],[82,13,83,33],[82,34,83,37],[84,13,85,33],[84,34,85,37],[104,13,105,33],[104,34,105,37],[106,13,107,33],[106,34,107,37],[108,13,109,33],[108,34,109,37],[74,13,75,33],[74,34,75,37],[94,13,95,33],[94,34,95,37],[96,13,97,33],[96,34,97,37],[92,13,93,33],[92,34,93,37],[98,0,99,33],[98,34,99,37],[74,2,77,12],[78,2,81,12],[82,2,87,12],[88,2,95,12],[96,2,97,12],[76,13,77,33],[76,34,77,37],[78,13,79,33],[98,38,98,45],[99,38,99,45],[100,0,101,29],[100,30,101,33],[100,47,101,49],[102,13,103,33],[102,34,103,37],[138,47,139,49],[136,0,137,33],[136,34,137,37],[136,38,136,45],[137,38,137,45],[128,13,129,33],[128,34,129,37],[110,13,111,33],[110,34,111,37],[112,13,113,33],[112,34,113,37],[114,13,115,33],[114,34,115,37],[116,13,117,33],[116,34,117,37],[134,0,135,1],[132,0,133,1],[118,0,119,29],[118,30,119,33],[118,47,119,49],[120,13,121,33],[120,34,121,37],[122,13,123,33],[122,34,123,37],[124,13,125,33],[124,34,125,37],[126,13,127,33],[126,34,127,37],[130,13,131,33],[130,34,131,37],[120,2,121,12],[122,2,123,12],[124,2,131,12],[124,0,131,1],[122,0,123,1],[120,0,121,1],[132,13,133,33],[132,34,133,37],[134,13,135,33],[140,13,141,33],[140,34,141,37],[134,34,135,37],[144,13,145,33],[144,34,145,37],[132,2,133,12],[134,2,135,12],[138,0,139,29],[138,30,139,33],[156,13,157,33],[156,34,157,37],[158,13,159,33],[158,34,159,37],[156,2,159,12],[156,0,159,1],[154,0,155,29],[154,30,155,33],[146,13,147,33],[146,34,147,37],[148,13,149,33],[148,34,149,37],[150,13,151,33],[150,34,151,37],[152,13,153,33],[152,34,153,37],[140,2,153,12],[140,0,153,1],[142,13,143,33],[142,34,143,37],[143,38,153,45],[123,38,135,45],[105,38,117,45],[76,38,97,45],[49,38,61,45],[154,47,155,49],[159,38,159,45],[74,0,77,1],[78,0,81,1],[82,0,87,1],[88,0,95,1],[96,0,97,1],[110,2,117,12],[108,2,109,12],[106,2,107,12],[102,2,105,12],[102,0,105,1],[106,0,107,1],[108,0,109,1],[110,0,117,1],[86,13,87,33],[86,34,87,37],[64,2,67,12],[68,2,73,12]]}
["Baccalauréat professionnel « maintenance des équipements industriels »"]
["Épreuve E31 (Unité U31) : SURVEILLER, AMELIORER, MODIFIER LES EQUIPEMENTS Parties A et B"]
["Établissement : (tampon)",null,null,null,null,null,null,null,null,null,null,null,null,null,null,null,null,null,null,null,null,null,null,"Session : ",null,null,null,null,null,null,{"$f":"IF(Bilan!B2=\"\",\"\",Bilan!B2)","v":""}]
[{"$f":"IF(Bilan!B3=\"\",\"\",Bilan!B3)","v":""},null,null,null,null,null,null,null,null,null,null,null,null,null,null,null,null,null,null,null,null,null,null,"Nom du candidat:",null,null,null,null,null,null,{"$f":"IF(INDEX((Bilan!B5:B34),(MATCH(RIGHT(CELL(\"nomfichier\",A1),LEN(CELL(\"nomfichier\",A1))-FIND(\"]\",CELL(\"nomfichier\",A1))),Bilan!G5:G34,0)))=\"\",\"\",INDEX((Bilan!B5:B34),(MATCH(RIGHT(CELL(\"nomfichier\",A1),LEN(CELL(\"nomfichier\",A1))-FIND(\"]\",CELL(\"nomfichier\",A1))),Bilan!G5:G34,0))))","v":{"$error":"#N/A"}}]
[null,null,null,null,null,null,null,null,null,null,null,null,null,null,null,null,null,null,null,null,null,null,null,"Prénom : "]
[null,null,null,null,null,null,null,null,null,null,null,null,null,null,null,null,null,null,null,null,null,null,null,"Date de l'évaluation:"]
["Lieu d’évaluation :"]
["      Etablissement"]
["      Entreprise :       "]
["Description sommaire du travail demandé :"]
[]
[]
["Données et condition de réalisation."]
["X","Le bien et les conditions de son environnement",null,null,null,null,null,null,null,null,null,null,null,null,null,null,null,null,null,null,null,null,null,"X","Les composants et les conditions de leur environnement"]
["X","Le dossier technique du bien et son dossier de maintenance  sur supports papiers ou supports numériques",null,null,null,null,null,null,null,null,null,null,null,null,null,null,null,null,null,null,null,null,null,"X","Toutes informations en provenance de l’utilisateur ou d’autres intervenants"]
["X","Les consignes d’exploitation",null,null,null,null,null,null,null,null,null,null,null,null,null,null,null,null,null,null,null,null,null,"X","Les consommables"]
["X","Toutes informations en provenance de l’utilisateur",null,null,null,null,null,null,null,null,null,null,null,null,null,null,null,null,null,null,null,null,null,"X","Les équipements de protection individuels et collectifs"]
["X","Document unique d’évaluation des risques",null,null,null,null,null,null,null,null,null,null,null,null,null,null,null,null,null,null,null,null,null,"X","Les outillages, matériels de contrôle, de mesure, moyens de manutention."]
["X","Le document de recette",null,null,null,null,null,null,null,null,null,null,null,null,null,null,null,null,null,null,null,null,null,"X","Les nouvelles énergies sont disponibles."]
["X","Les normes",null,null,null,null,null,null,null,null,null,null,null,null,null,null,null,null,null,null,null,null,null,"X","Le dossier de manutention."]
["X","Toutes documentations techniques",null,null,null,null,null,null,null,null,null,null,null,null,null,null,null,null,null,null,null,null,null,"X","Le dossier environnement."]
["X","Le plan de prévention",null,null,null,null,null,null,null,null,null,null,null,null,null,null,null,null,null,null,null,null,null,"X","Le dossier historique du bien."]
["X","Le bon de travail.",null,null,null,null,null,null,null,null,null,null,null,null,null,null,null,null,null,null,null,null,null,"X","Les documents utilisateurs du ou des postes de travail."]
["X","Les consignes et/ou procédures écrites",null,null,null,null,null,null,null,null,null,null,null,null,null,null,null,null,null,null,null,null,null,"X","Tous documents nouveaux nécessaires à la compréhension de l’information :\n- Nouvelle notice technique. Compte-rendu d’intervention.-Documents de modification.\n"]
["X","Plan d’implantation du bien",null,null,null,null,null,null,null,null,null,null,null,null,null,null,null,null,null,null,null,null,null,"X","Le dossier technique du bien et de la modification"]
[]
["     ÇRepérer les données fournies",null,null,null,null,null,null,null,null,null,null,null,null,null,null,null,null,null,null,null,null,null,null,null,"ÇRepérer les données fournies"]
["Travail demandé"]
["X","A1-T4",null,"Réaliser la maintenance corrective - Rendre compte de son intervention."]
["X","A1-T5",null,"Réaliser la maintenance corrective - Actualiser le dossier technique des biens. "]
["X","A2-T1",null,"Réaliser la maintenance préventive - Réaliser des opérations de surveillance."]
["X","A2-T3",null,"Réaliser la maintenance préventive - Alerter si une anomalie est constatée."]
["X","A3-T2",null,"Mettre en œuvre des améliorations, des modifications -Préparer et réaliser l’amélioration ou la modification."]
["X","A5-T1",null,"Communiquer avec le(s) utilisateur(s), le(s) client(s) et au sein d’une équipe - Dialoguer au sein d’une équipe, d’un groupe de réflexion."]
["X","A5-T2",null,"Communiquer avec le(s) utilisateur(s), le(s) client(s) et au sein d’une équipe - Signaler, transmettre des informations."]
["Consulter le référentiel des activités professionnelles pour obtenir le détail des tâches."]
["Ç Repérer les tâches demandées (ce sont celles qui correspondent à l’unité dans le référentiel de certification, à l’exclusion de toute autre)"]
["Appréciation globale et proposition de note : "]
[]
["Noms et signatures des évaluateurs :\n\n\n",null,null,null,null,null,null,null,null,null,null,null,null,null,null,null,null,null,null,null,null,null,null,null,null,null,null,null,null,null,null,null,null,null,null,"Note proposée :          ",null,null,null,null,{"$f":"IF(AI184=\"\",\"\",AI184)","v":""},null,null,"/20"]
[null,null,null,null,null,null,null,null,null,null,null,null,null,null,null,null,null,null,null,null,null,null,null,null,null,null,null,null,null,null,null,null,null,null,null,"Note affectée de son coefficient :",null,null,null,null,{"$f":"IF(AO40=\"\",\"\",AO40*2)","v":""},null,null,"/40"]
["Nota important : La proposition de note sera issue de cette grille d’évaluation, complétée conjointement par le tuteur de l’entreprise et l’enseignant lors de la situation d’évaluation, en s’appuyant sur le livret individuel de formation. Un dossier constitué de fiches de compte rendu d’activités, renseignées par le candidat lors des travaux réalisés en entreprise servira de support lors de l’entretien. Ce dossier doit contenir les éléments justifiant l’évaluation proposée ; il n’est pas noté."]
["Baccalauréat professionnel « maintenance des équipements industriels »  – Unité U 31\nPartie A de la sous épreuve U31 : Les activités professionnelles",null,null,null,null,null,null,null,null,null,null,null,null,null,null,null,null,null,null,null,null,null,null,null,null,null,null,null,null,null,null,null,null,null,"Validé",null,null,null,"-       Synthèse    +"]
[]
["CP 1.4 - Exécuter des opérations de surveillance et d’inspection",null,null,null,null,null,null,null,null,null,null,null,null,null,null,null,null,null,null,null,null,null,null,null,null,null,null,null,null,null,"Evalué",null,null,null,{"$f":"IF(AE45=\"Non Evalué\",\"NE\",IF(AE45=\"Evalué\",\"E\",\"\"))","v":"E"},{"$f":"COUNTIF(AI47:AL62,\"Validé\")","v":0},{"$f":"COUNTIF(AI47:AL62,\"Non Validé\")","v":0},{"$f":"COUNTIF(AI47:AL62,\"Non Evalué\")","v":0},null,null,null,null,null,null,null,null,null,{"$f":"IF(AE45=\"\",\"Souhaitez-vous évaluer la compétence ?\",IF(AND(AE45=\"Non Evalué\",OR(AJ45<>0,AK45<>0)),\"Vous avez choisi de ne pas évaluer la compétence. Ne rien indiquez dans la colonne Validé.\",IF(AND(AE45=\"Evalué\",OR(AI47=\"\",AI49=\"\",AI51=\"\",AI53=\"\",AI55=\"\",AI57=\"\",AI59=\"\",AI61=\"\")),\"Vous avez choisi d'évaluer la compétence. Indiquez pour chaques actions : Validé, Non Validé ou Non Evalué.\",IF(OR(AE45=\"Non Evalué\",(AJ45+AK45)=0),\"\",CONCATENATE(ROUND((100*AJ46/(AJ46+AK46)),0),\" % d'actions validées. \",AJ45,\" validée(s) sur \",AJ45+AK45,\" . Conseil: Au maximum , grisez \",ROUND((100*AJ46/(AJ46+AK46))*8/100,0),\" colonnes\")))))","v":"Vous avez choisi d'évaluer la compétence. Indiquez pour chaques actions : Validé, Non Validé ou Non Evalué."}]
[null,null,null,null,null,null,null,null,null,null,null,null,null,null,null,null,null,null,null,null,null,null,null,null,null,null,null,null,null,null,null,null,null,null,null,{"$f":"SUMPRODUCT((AI47:AL62=\"Validé\")*(Bareme!AE134:AE149))","v":0},{"$f":"SUMPRODUCT((AI47:AL62=\"Non Validé\")*(Bareme!AE134:AE149))","v":0}]
[1,null,"Mettre le bien dans les conditions requises pour effectuer les mesures, les contrôles et les surveillances.",null,null,null,null,null,null,null,null,null,null,"Le plan de prévention est compris et respecté",null,null,null,null,null,null,null,null,null,null,null,null,null,null,null,null,null,null,null,null,null,null,null,null,null,null,null,null,null,null,null,null,null,0]
[]
[2,null,"Surveiller un bien :\n• surveiller le fonctionnement en mobilisant les cinq sens,\n• vérifier les données de contrôle (indicateurs, voyants…), repérer les dérives.",null,null,null,null,null,null,null,null,null,null,"Les signes d’anomalies sont détectés."]
[null,null,null,null,null,null,null,null,null,null,null,null,null,null,null,null,null,null,null,null,null,null,null,null,null,null,null,null,null,null,null,null,null,null,null,null,null,null,"Commentaires:\n"]
[null,null,null,null,null,null,null,null,null,null,null,null,null,"Les données sont lues et les dérives détectées."]
[]
[3,null,"Effectuer les mesures et les contrôles :\n• localiser les points de contrôle sur le bien,\n• régler, calibrer les appareils ou matériels de contrôle,\n• collecter  et reporter les résultats des mesures et des contrôles.",null,null,null,null,null,null,null,null,null,null,"Les points de contrôle sont repérés sans erreurs."]
[]
[null,null,null,null,null,null,null,null,null,null,null,null,null,"Les calibres sont choisis et les réglages sont effectués correctement."]
[]
[null,null,null,null,null,null,null,null,null,null,null,null,null,"Les résultats des mesures et contrôles sont collectés et écrits sans erreurs."]
[]
[4,null,"Remettre le bien dans les conditions normales de fonctionnement.",null,null,null,null,null,null,null,null,null,null,"Le bien est dans les conditions normales de fonctionnement."]
[]
[5,null,"Saisir ou rédiger un compte-rendu d’intervention.",null,null,null,null,null,null,null,null,null,null,"Le compte-rendu, écrit ou saisi, est pertinent et exploitable."]
[]
["CP 1.5 - Exécuter les travaux d’amélioration ou de modification du bien",null,null,null,null,null,null,null,null,null,null,null,null,null,null,null,null,null,null,null,null,null,null,null,null,null,null,null,null,null,"Evalué",null,null,null,{"$f":"IF(AE63=\"Non Evalué\",\"NE\",IF(AE63=\"Evalué\",\"E\",\"\"))","v":"E"},{"$f":"COUNTIF(AI65:AL98,\"Validé\")","v":0},{"$f":"COUNTIF(AI65:AL98,\"Non Validé\")","v":0},{"$f":"COUNTIF(AI65:AL98,\"Non Evalué\")","v":0},null,null,null,null,null,null,null,null,null,{"$f":"IF(AE63=\"\",\"Souhaitez-vous évaluer la compétence ?\",IF(AND(AE63=\"Non Evalué\",OR(AJ63<>0,AK63<>0)),\"Vous avez choisi de ne pas évaluer la compétence. Ne rien indiquez dans la colonne Validé.\",IF(AND(AE63=\"Evalué\",OR(AI65=\"\",AI67=\"\",AI69=\"\",AI71=\"\",AI73=\"\",AI75=\"\",AI77=\"\",AI79=\"\",AI81=\"\",AI83=\"\",AI85=\"\",AI87=\"\",AI89=\"\",AI91=\"\",AI93=\"\",AI95=\"\",AI97=\"\")),\"Vous avez choisi d'évaluer la compétence. Indiquez pour chaques actions : Validé, Non Validé ou Non Evalué.\",IF(OR(AE63=\"Non Evalué\",(AJ63+AK63)=0),\"\",CONCATENATE(ROUND((100*AJ64/(AJ64+AK64)),0),\" % d'actions validées. \",AJ63,\" validée(s) sur \",AJ63+AK63,\" . Conseil: Au maximum , grisez \",ROUND((100*AJ64/(AJ64+AK64))*8/100,0),\" colonnes\")))))","v":"Vous avez choisi d'évaluer la compétence. Indiquez pour chaques actions : Validé, Non Validé ou Non Evalué."}]
[null,null,null,null,null,null,null,null,null,null,null,null,null,null,null,null,null,null,null,null,null,null,null,null,null,null,null,null,null,null,null,null,null,null,null,{"$f":"SUMPRODUCT((AI65:AL98=\"Validé\")*(Bareme!AE152:AE185))","v":0},{"$f":"SUMPRODUCT((AI65:AL98=\"Non Validé\")*(Bareme!AE152:AE185))","v":0}]
[1,null,"Préparer la zone d’intervention (bien et son environnement).",null,null,null,null,null,null,null,null,null,null,"La zone est libérée, nettoyée et sécurisée.",null,null,null,null,null,null,null,null,null,null,null,null,null,null,null,null,null,null,null,null,null,null,null,null,null,null,null,null,null,null,null,null,null,0]
[]
[null,null,null,null,null,null,null,null,null,null,null,null,null,"Les énergies sont repérées, le bien est consigné."]
[]
[2,null,"Effectuer la dépose de la partie du bien à modifier.",null,null,null,null,null,null,null,null,null,null,"Les composants sont repérés et déposés suivant un ordre logique."]
[]
[null,null,null,null,null,null,null,null,null,null,null,null,null,"Les composants à conserver ne sont pas endommagés."]
[]
[null,null,null,null,null,null,null,null,null,null,null,null,null,"Les éléments d’assemblage sont classés."]
[]
[3,null,"Réceptionner les travaux externalisés",null,null,null,null,null,null,null,null,null,null,"Les éléments reçus sont vérifiés : dimensions, nature des matériaux,"]
[]
[null,null,null,null,null,null,null,null,null,null,null,null,null,"Les éléments reçus sont vérifiés : quantité, aspect, caractéristiques …",null,null,null,null,null,null,null,null,null,null,null,null,null,null,null,null,null,null,null,null,null,null,null,null,"Commentaires:\n"]
[]
[4,null,"Installer les éléments de l’amélioration ou de la modification.",null,null,null,null,null,null,null,null,null,null,"Tous les composants sont assemblés et montés dans le respect des procédures et des notices techniques."]
[]
[null,null,null,null,null,null,null,null,null,null,null,null,null,"Les énergies sont raccordées."]
[]
[5,null,"Effectuer les tests et procéder à la mise au point(réglages, paramétrages…)",null,null,null,null,null,null,null,null,null,null,"Les paramétrages sont corrects  et respectent les procédures prédéfinies."]
[]
[null,null,null,null,null,null,null,null,null,null,null,null,null,"Les réglages sont effectués."]
[]
[null,null,null,null,null,null,null,null,null,null,null,null,null,"Le bien est prêt pour la mise en service."]
[]
[6,null,"Rétablir l’environnement du bien.",null,null,null,null,null,null,null,null,null,null,"L’environnement du bien est préparé et nettoyé."]
[]
[null,null,null,null,null,null,null,null,null,null,null,null,null,"Les outillages et les équipements sont rangés."]
[]
[null,null,null,null,null,null,null,null,null,null,null,null,null,"Les déchets sont éliminés."]
[]
[null,null,null,null,null,null,null,null,null,null,null,null,null,"Les pièces, les composants, les consommables sont classés ou réformés."]
[]
[7,null,"Mettre en service le bien avec l’exploitant (après déconsignation).",null,null,null,null,null,null,null,null,null,null,"Les performances attendues sont atteintes."]
[]
["Baccalauréat professionnel « maintenance des équipements industriels »  – Unité U 31\nPartie A de la sous épreuve U31 : Les activités professionnelles",null,null,null,null,null,null,null,null,null,null,null,null,null,null,null,null,null,null,null,null,null,null,null,null,null,null,null,null,null,null,null,null,null,"Validé",null,null,null,"-       Synthèse    +"]
[]
["CP 4.1 - Recevoir et transmettre des informations",null,null,null,null,null,null,null,null,null,null,null,null,null,null,null,null,null,null,null,null,null,null,null,null,null,null,null,null,null,"Evalué",null,null,null,{"$f":"IF(AE101=\"Non Evalué\",\"NE\",IF(AE101=\"Evalué\",\"E\",\"\"))","v":"E"},{"$f":"COUNTIF(AI103:AL118,\"Validé\")","v":0},{"$f":"COUNTIF(AI103:AL118,\"Non Validé\")","v":0},{"$f":"COUNTIF(AI103:AL118,\"Non Evalué\")","v":0},null,null,null,null,null,null,null,null,null,{"$f":"IF(AE101=\"\",\"Souhaitez-vous évaluer la compétence ?\",IF(AND(AE101=\"Non Evalué\",OR(AJ101<>0,AK101<>0)),\"Vous avez choisi de ne pas évaluer la compétence. Ne rien indiquez dans la colonne Validé.\",IF(AND(AE101=\"Evalué\",OR(AI103=\"\",AI105=\"\",AI107=\"\",AI109=\"\",AI111=\"\",AI113=\"\",AI115=\"\",AI117=\"\")),\"Vous avez choisi d'évaluer la compétence. Indiquez pour chaques actions : Validé, Non Validé ou Non Evalué.\",IF(OR(AE101=\"Non Evalué\",(AJ101+AK101)=0),\"\",CONCATENATE(ROUND((100*AJ102/(AJ102+AK102)),0),\" % d'actions validées. \",AJ101,\" validée(s) sur \",AJ101+AK101,\" . Conseil: Au maximum , grisez \",ROUND((100*AJ102/(AJ102+AK102))*8/100,0),\" colonnes\")))))","v":"Vous avez choisi d'évaluer la compétence. Indiquez pour chaques actions : Validé, Non Validé ou Non Evalué."}]
[null,null,null,null,null,null,null,null,null,null,null,null,null,null,null,null,null,null,null,null,null,null,null,null,null,null,null,null,null,null,null,null,null,null,null,{"$f":"SUMPRODUCT((AI103:AL118=\"Validé\")*(Bareme!AE188:AE203))","v":0},{"$f":"SUMPRODUCT((AI103:AL118=\"Non Validé\")*(Bareme!AE188:AE203))","v":0}]
[1,null,"Comprendre, s’approprier un ordre, une consigne, un constat de défaillance.\nQuestionner l’exploitation du bien afin de compléter les informations.\n",null,null,null,null,null,null,null,null,null,null,"Les paramètres, les éléments du message sont compris sans déformation et dans leur intégralit\n",null,null,null,null,null,null,null,null,null,null,null,null,null,null,null,null,null,null,null,null,null,null,null,null,null,null,null,null,null,null,null,null,null,0]
[]
[null,null,null,null,null,null,null,null,null,null,null,null,null,"Les questions posées sont pertinentes par rapport à la problématique à résoudre et les réponses retenues sont en adéquation avec le problème.\n"]
[null,null,null,null,null,null,null,null,null,null,null,null,null,null,null,null,null,null,null,null,null,null,null,null,null,null,null,null,null,null,null,null,null,null,null,null,null,null,"Commentaires:\n"]
[2,null,"Extraire les éléments nécessaires à l’information au sein de la documentation disponible",null,null,null,null,null,null,null,null,null,null,"Le choix de la documentation retenue est judicieux et les informations collectées sont comprises et exploitées sans erreur.\n"]
[]
[3,null,"Analyser les informations (ordre, consignes, constat) et  les éléments recueillis (documentation).",null,null,null,null,null,null,null,null,null,null,"La synthèse est cohérente avec la problématique."]
[]
[4,null,"Formuler oralement ou par écrit la synthèse de son analyse en utilisant les diverses formes de langages et de communication technique ou scientifique.",null,null,null,null,null,null,null,null,null,null,"A l’écrit, la formulation est claire, univoque. Elle utilise le langage le mieux adapté pour la compréhension du message."]
[]
[null,null,null,null,null,null,null,null,null,null,null,null,null,"Les désignations employées sont normalisées."]
[]
[null,null,null,null,null,null,null,null,null,null,null,null,null,"L’expression orale doit être structurée et le vocabulaire utilisé précis. Elle permet une compréhension sans équivoque du message à transmettre."]
[]
[null,null,null,null,null,null,null,null,null,null,null,null,null,"Le message transmis comporte les éléments essentiels."]
[]
["CP 4.2 - Rédiger et argumenter des comptes rendus.",null,null,null,null,null,null,null,null,null,null,null,null,null,null,null,null,null,null,null,null,null,null,null,null,null,null,null,null,null,"Evalué",null,null,null,{"$f":"IF(AE119=\"Non Evalué\",\"NE\",IF(AE119=\"Evalué\",\"E\",\"\"))","v":"E"},{"$f":"COUNTIF(AI121:AL136,\"Validé\")","v":0},{"$f":"COUNTIF(AI121:AL136,\"Non Validé\")","v":0},{"$f":"COUNTIF(AI121:AL136,\"Non Evalué\")","v":0},null,null,null,null,null,null,null,null,null,{"$f":"IF(AE119=\"\",\"Souhaitez-vous évaluer la compétence ?\",IF(AND(AE119=\"Non Evalué\",OR(AJ119<>0,AK119<>0)),\"Vous avez choisi de ne pas évaluer la compétence. Ne rien indiquez dans la colonne Validé.\",IF(AND(AE119=\"Evalué\",OR(AI121=\"\",AI123=\"\",AI125=\"\",AI127=\"\",AI129=\"\",AI131=\"\",AI133=\"\",AI135=\"\")),\"Vous avez choisi d'évaluer la compétence. Indiquez pour chaques actions : Validé, Non Validé ou Non Evalué.\",IF(OR(AE119=\"Non Evalué\",(AJ119+AK119)=0),\"\",CONCATENATE(ROUND((100*AJ120/(AJ120+AK120)),0),\" % d'actions validées. \",AJ119,\" validée(s) sur \",AJ119+AK119,\" . Conseil: Au maximum , grisez \",ROUND((100*AJ120/(AJ120+AK120))*8/100,0),\" colonnes\")))))","v":"Vous avez choisi d'évaluer la compétence. Indiquez pour chaques actions : Validé, Non Validé ou Non Evalué."}]
[null,null,null,null,null,null,null,null,null,null,null,null,null,null,null,null,null,null,null,null,null,null,null,null,null,null,null,null,null,null,null,null,null,null,null,{"$f":"SUMPRODUCT((AI121:AL136=\"Validé\")*(Bareme!AE206:AE221))","v":0},{"$f":"SUMPRODUCT((AI121:AL136=\"Non Validé\")*(Bareme!AE206:AE221))","v":0}]
[1,null,"Identifier les informations pertinentes relatives à la maintenance.",null,null,null,null,null,null,null,null,null,null,"Les informations pertinentes sont retenues.  ",null,null,null,null,null,null,null,null,null,null,null,null,null,null,null,null,null,null,null,null,null,null,null,null,null,null,null,null,null,null,null,null,null,0]
[]
[2,null,"Choisir les outils de descriptions les mieux adaptés au compte-rendu.",null,null,null,null,null,null,null,null,null,null,"Les documents pour rendre compte sont proposés avec pertinence (schémas, plans, procédures, dossiers technique et de maintenance"]
[null,null,null,null,null,null,null,null,null,null,null,null,null,null,null,null,null,null,null,null,null,null,null,null,null,null,null,null,null,null,null,null,null,null,null,null,null,null,"Commentaires:"]
[3,null,"Rédiger et mettre en forme le compte-rendu.",null,null,null,null,null,null,null,null,null,null,"A l’écrit, la formulation est claire, univoque. Elle utilise le langage le mieux adapté pour la compréhension du compte-rendu"]
[]
[null,null,null,null,null,null,null,null,null,null,null,null,null,"Les désignations employées sont normalisées"]
[]
[null,null,null,null,null,null,null,null,null,null,null,null,null,"L’expression orale doit être structurée et le vocabulaire utilisé précis. Elle permet une compréhension sans équivoque du compte-rendu."]
[]
[null,null,null,null,null,null,null,null,null,null,null,null,null,"Le compte-rendu transmis comporte les éléments essentiels."]
[]
[4,null,"Proposer si nécessaire :\n• les éléments de mise à jour des documents : techniques, de sécurités, de procédures\n• tous documents, informations nécessaires à la bonne compréhension de l’intervention\n",null,null,null,null,null,null,null,null,null,null,"Les éléments proposés sont pertinents et utilisables."]
[]
[5,null,"Préciser éventuellement les difficultés rencontrées.",null,null,null,null,null,null,null,null,null,null,"L’écart entre le travail réalisé et le travail demandé est décrit et argumenté"]
[]
["Baccalauréat professionnel « maintenance des équipements industriels »  – Unité U 31\nPartie B de la sous épreuve U31 : Etude de cas",null,null,null,null,null,null,null,null,null,null,null,null,null,null,null,null,null,null,null,null,null,null,null,null,null,null,null,null,null,null,null,null,null,"Validé",null,null,null,"-       Synthèse    +"]
[]
["Exposer l'étude de cas",null,null,null,null,null,null,null,null,null,null,null,null,null,null,null,null,null,null,null,null,null,null,null,null,null,null,null,null,null,"Evalué",null,null,null,{"$f":"IF(AE139=\"Non Evalué\",\"NE\",IF(AE139=\"Evalué\",\"E\",\"\"))","v":"E"},{"$f":"COUNTIF(AI141:AL154,\"Validé\")","v":0},{"$f":"COUNTIF(AI141:AL154,\"Non Validé\")","v":0},{"$f":"COUNTIF(AI141:AL154,\"Non Evalué\")","v":0},null,null,null,null,null,null,null,null,null,{"$f":"IF(AE139=\"\",\"Souhaitez-vous évaluer la compétence ?\",IF(AND(AE139=\"Non Evalué\",OR(AJ139<>0,AK139<>0)),\"Vous avez choisi de ne pas évaluer la compétence. Ne rien indiquez dans la colonne Validé.\",IF(AND(AE139=\"Evalué\",OR(AI141=\"\",AI143=\"\",AI145=\"\",AI147=\"\",AI149=\"\",AI151=\"\",AI153=\"\")),\"Vous avez choisi d'évaluer la compétence. Indiquez pour chaques actions : Validé, Non Validé ou Non Evalué.\",IF(OR(AE139=\"Non Evalué\",(AJ139+AK139)=0),\"\",CONCATENATE(ROUND((100*AJ140/(AJ140+AK140)),0),\" % d'actions validées. \",AJ139,\" validée(s) sur \",AJ139+AK139,\" . Conseil: Au maximum , grisez \",ROUND((100*AJ140/(AJ140+AK140))*8/100,0),\" colonnes\")))))","v":"Vous avez choisi d'évaluer la compétence. Indiquez pour chaques actions : Validé, Non Validé ou Non Evalué."}]
[null,null,null,null,null,null,null,null,null,null,null,null,null,null,null,null,null,null,null,null,null,null,null,null,null,null,null,null,null,null,null,null,null,null,null,{"$f":"SUMPRODUCT((AI141:AL154=\"Validé\")*(Bareme!AE224:AE237))","v":0},{"$f":"SUMPRODUCT((AI141:AL154=\"Non Validé\")*(Bareme!AE224:AE237))","v":0}]
[1,null,"Exposer l’Etude de cas",null,null,null,null,null,null,null,null,null,null,"L’exposé traduit  sans équivoque le résultat des analyses relatées dans le rapport: la description de l’équipement,",null,null,null,null,null,null,null,null,null,null,null,null,null,null,null,null,null,null,null,null,null,null,null,null,null,null,null,null,null,null,null,null,null,0]
[]
[null,null,null,null,null,null,null,null,null,null,null,null,null,"L’exposé traduit  sans équivoque le résultat des analyses relatées dans le rapport: énoncer de la problematique relative à la  maintenance"]
[null,null,null,null,null,null,null,null,null,null,null,null,null,null,null,null,null,null,null,null,null,null,null,null,null,null,null,null,null,null,null,null,null,null,null,null,null,null,"Commentaires:"]
[null,null,null,null,null,null,null,null,null,null,null,null,null,"L’exposé traduit  sans équivoque le résultat des analyses relatées dans le rapport: la présentation de la solution retenue."]
[]
[null,null,null,null,null,null,null,null,null,null,null,null,null,"L’exposé traduit  sans équivoque la mise en œuvre des propositions techniques : la description des interventions réalisées,"]
[]
[null,null,null,null,null,null,null,null,null,null,null,null,null,"L’exposé traduit  sans équivoque la mise en œuvre des propositions techniques : l’intégration des procédures de sécurité,"]
[]
[null,null,null,null,null,null,null,null,null,null,null,null,null,"L’exposé traduit  sans équivoque la mise en œuvre des propositions techniques : l’intégration des procédures d’hygiène,"]
[]
[null,null,null,null,null,null,null,null,null,null,null,null,null,"L’exposé traduit  sans équivoque la mise en œuvre des propositions techniques : la prise en compte de l’environnement."]
[]
["Donner des informations complémentaires",null,null,null,null,null,null,null,null,null,null,null,null,null,null,null,null,null,null,null,null,null,null,null,null,null,null,null,null,null,"Evalué",null,null,null,{"$f":"IF(AE155=\"Non Evalué\",\"NE\",IF(AE155=\"Evalué\",\"E\",\"\"))","v":"E"},{"$f":"COUNTIF(AI157:AL160,\"Validé\")","v":0},{"$f":"COUNTIF(AI157:AL160,\"Non Validé\")","v":0},{"$f":"COUNTIF(AI157:AL160,\"Non Evalué\")","v":0},null,null,null,null,null,null,null,null,null,{"$f":"IF(AE155=\"\",\"Souhaitez-vous évaluer la compétence ?\",IF(AND(AE155=\"Non Evalué\",OR(AJ155<>0,AK155<>0)),\"Vous avez choisi de ne pas évaluer la compétence. Ne rien indiquez dans la colonne Validé.\",IF(AND(AE155=\"Evalué\",OR(AI157=\"\",AI159=\"\")),\"Vous avez choisi d'évaluer la compétence. Indiquez pour chaques actions : Validé, Non Validé ou Non Evalué.\",IF(OR(AE155=\"Non Evalué\",(AJ155+AK155)=0),\"\",CONCATENATE(ROUND((100*AJ156/(AJ156+AK156)),0),\" % d'actions validées. \",AJ155,\" validée(s) sur \",AJ155+AK155,\" . Conseil: Au maximum , grisez \",ROUND((100*AJ156/(AJ156+AK156))*8/100,0),\" colonnes\")))))","v":"Vous avez choisi d'évaluer la compétence. Indiquez pour chaques actions : Validé, Non Validé ou Non Evalué."}]
[null,null,null,null,null,null,null,null,null,null,null,null,null,null,null,null,null,null,null,null,null,null,null,null,null,null,null,null,null,null,null,null,null,null,null,{"$f":"SUMPRODUCT((AI157:AL160=\"Validé\")*(Bareme!AE240:AE243))","v":0},{"$f":"SUMPRODUCT((AI157:AL160=\"Non Validé\")*(Bareme!AE240:AE243))","v":0}]
[2,null,"Donner des informations complémentaires.",null,null,null,null,null,null,null,null,null,null,"Les réponses aux membres de la commission d’évaluation permettent d’apporter des informations complémentaires,",null,null,null,null,null,null,null,null,null,null,null,null,null,null,null,null,null,null,null,null,null,null,null,null,null,null,null,null,null,null,null,null,null,0]
[]
[null,null,null,null,null,null,null,null,null,null,null,null,null,"Les réponses aux membres de la commission d’évaluation permettent d’argumenter les choix effectués."]
[null,null,null,null,null,null,null,null,null,null,null,null,null,null,null,null,null,null,null,null,null,null,null,null,null,null,null,null,null,null,null,null,null,null,null,null,null,null,"Commentaires:\n"]
[]
[]
[]
[]
[]
[]
[]
[]
[]
[]
[]
[]
[]
[]
[]
[]
[]
[]
[]
[]
[null,null,null,null,{"$f":"IF(OR(I192=\"\",AND(AE45=\"\",AE63=\"\",AE101=\"\",AE119=\"\",AE139=\"\",AE155=\"\")=0),\"\",CONCATENATE(\"PROPOSITION: \",CEILING(I192,0.5),\"/20 (\",ROUND(100*COUNTIF(U191:U196,\"E\")/(COUNTIF(U191:U196,\"E\")+COUNTIF(U191:U196,\"NE\")),0),\"% des compétences évaluées).\"))","v":"PROPOSITION: 0/20 (100% des compétences évaluées)."}]
[]
[]
[null,null,null,null,"Proposition des évaluateurs:"]
[]
[]
[]
[null,null,null,null,"Ne pas effacer"]
[null,null,null,null,null,null,null,null,null,null,null,null,null,null,{"$f":"CONCATENATE(\"Statistique U31 de \",$AE$4)","v":{"$error":"#N/A"}}]
[null,null,null,null,null,null,null,null,null,null,null,null,null,null,"Compétences",{"$f":"IF(AE4=\"\",\"\",AE4)","v":{"$error":"#N/A"}},"Satisfaction maximale","Satisfaction moyenne",{"$f":"CONCATENATE(\"Statistique U31 de \",$AE$4)","v":{"$error":"#N/A"}},"Coefficients","Validée ou Non Validée"]
[null,null,"Somme",null,null,null,null,null,{"$f":"SUMPRODUCT((P191:P199))","v":0},null,{"$f":"SUM(Q191:Q199)","v":800},null,null,null,{"$f":"A45","v":"CP 1.4 - Exécuter des opérations de surveillance et d’inspection"},{"$f":"IF(OR(U191=\"NE\",U191=\"\"),\"\",S191*T191)","v":0},{"$f":"IF(OR(U191=\"NE\",U191=\"\"),\"\",T191*8)","v":120},{"$f":"IF(OR(U191=\"NE\",U191=\"\"),\"\",Q191/2)","v":60},{"$f":"IF(AV47=\"\",\"\",AV47)","v":0},{"$f":"Bareme!AE132","v":15},{"$f":"IF(AI45=\"\",\"\",AI45)","v":"E"}]
[null,null,"Moyenne /20",null,null,null,null,null,{"$f":"IF($K$191=0,\"\",K192*$I$191/$K$191)","v":0},null,20,null,null,null,{"$f":"A63","v":"CP 1.5 - Exécuter les travaux d’amélioration ou de modification du bien"},{"$f":"IF(OR(U192=\"NE\",U192=\"\"),\"\",S192*T192)","v":0},{"$f":"IF(OR(U192=\"NE\",U192=\"\"),\"\",T192*8)","v":208},{"$f":"IF(OR(U192=\"NE\",U192=\"\"),\"\",Q192/2)","v":104},{"$f":"IF(AV65=\"\",\"\",AV65)","v":0},{"$f":"Bareme!AE150","v":26},{"$f":"IF(AI63=\"\",\"\",AI63)","v":"E"}]
[null,null,"Moyenne /40",null,null,null,null,null,{"$f":"IF($K$191=0,\"\",K193*$I$191/$K$191)","v":0},null,40,null,null,null,{"$f":"A101","v":"CP 4.1 - Recevoir et transmettre des informations"},0,96,48,{"$f":"IF(AV103=\"\",\"\",AV103)","v":0},{"$f":"Bareme!AE186","v":12},{"$f":"IF(AI101=\"\",\"\",AI101)","v":"E"}]
[null,null,null,null,null,null,null,null,null,null,null,null,null,null,{"$f":"A119","v":"CP 4.2 - Rédiger et argumenter des comptes rendus."},0,96,48,{"$f":"IF(AV121=\"\",\"\",AV121)","v":0},{"$f":"Bareme!AE204","v":12},{"$f":"IF(AI119=\"\",\"\",AI119)","v":"E"}]
[null,null,null,null,null,null,null,null,null,null,null,null,null,null,{"$f":"A139","v":"Exposer l'étude de cas"},0,136,68,{"$f":"IF(AV141=\"\",\"\",AV141)","v":0},{"$f":"Bareme!AE222","v":17},{"$f":"IF(AI139=\"\",\"\",AI139)","v":"E"}]
[null,null,null,null,null,null,null,null,null,null,null,null,null,null,{"$f":"A155","v":"Donner des informations complémentaires"},0,144,72,{"$f":"IF(AV157=\"\",\"\",AV157)","v":0},{"$f":"Bareme!AE238","v":18},{"$f":"IF(AI155=\"\",\"\",AI155)","v":"E"}]
[null,null,null,null,"Ne pas effacer"]

{"sheet":"U32","index":7,"n_rows":92,"n_cols":48,"rows_kept":92,"cut":false,"hidden":true,"merged":[[5,47,5,48],[6,47,7,48],[0,0,0,45],[1,0,1,45],[2,0,2,22],[2,23,2,29],[2,30,2,45],[3,0,5,22],[3,23,3,29],[3,30,4,45],[4,23,4,29],[5,23,5,29],[5,30,5,45],[6,0,6,45],[7,0,7,45],[8,0,8,45],[9,0,9,45],[10,0,10,45],[19,1,19,22],[19,24,19,45],[20,1,20,22],[20,24,20,45],[21,1,21,22],[21,24,21,45],[16,1,16,22],[16,24,16,45],[17,1,17,22],[17,24,17,45],[18,1,18,22],[18,24,18,45],[12,0,12,45],[13,1,13,22],[13,24,13,45],[14,1,14,22],[14,24,14,45],[15,1,15,22],[15,24,15,45],[24,0,24,45],[25,1,25,2],[22,1,22,22],[22,24,22,45],[25,3,25,45],[26,3,26,45],[26,1,26,2],[27,0,27,45],[44,34,45,37],[28,0,28,45],[30,0,30,45],[31,0,31,45],[32,0,33,34],[32,35,32,39],[32,40,32,42],[32,43,32,45],[33,35,33,39],[33,40,33,42],[33,43,33,45],[36,30,37,33],[38,2,39,12],[38,0,39,1],[40,0,41,1],[34,0,35,33],[34,34,35,37],[34,38,34,45],[35,38,35,45],[38,34,39,37],[50,13,51,33],[48,34,49,37],[50,34,51,37],[40,13,41,33],[40,34,41,37],[42,13,43,33],[42,34,43,37],[44,13,45,33],[51,38,55,45],[36,47,37,49],[46,13,47,33],[46,34,47,37],[48,13,49,33],[38,13,39,33],[56,0,57,29],[56,30,57,33],[36,0,37,29],[56,47,57,49],[52,13,53,33],[52,34,53,37],[54,13,55,33],[54,34,55,37],[40,2,41,12],[42,0,43,1],[42,2,43,12],[44,0,47,1],[44,2,47,12],[48,0,49,1],[48,2,49,12],[50,0,53,1],[50,2,53,12],[54,0,55,1],[54,2,55,12],[84,14,84,20],[68,13,69,33],[68,34,69,37],[72,13,73,33],[72,34,73,37],[70,13,71,33],[70,34,71,37],[68,0,69,1],[68,2,69,12],[70,0,73,1],[70,2,73,12],[60,13,61,33],[60,34,61,37],[58,13,59,33],[66,0,67,1],[66,2,67,12],[75,4,77,39],[78,4,80,33],[78,34,80,39],[60,38,73,45],[58,34,59,37],[62,13,63,33],[62,34,63,37],[66,13,67,33],[66,34,67,37],[64,13,65,33],[64,34,65,37],[58,0,59,1],[58,2,59,12],[60,0,61,1],[60,2,61,12],[62,0,63,1],[62,2,63,12],[64,0,65,1],[64,2,65,12]]}
["Baccalauréat professionnel « maintenance des équipements industriels » "]
["Épreuve E32 (Unité U32) : INTERVENTION SUR UN EQUIPEMENT MECANIQUE"]
["Établissement : (tampon)",null,null,null,null,null,null,null,null,null,null,null,null,null,null,null,null,null,null,null,null,null,null,"Session : ",null,null,null,null,null,null,{"$f":"IF(Bilan!B2=\"\",\"\",Bilan!B2)","v":""}]
[{"$f":"IF(Bilan!B3=\"\",\"\",Bilan!B3)","v":""},null,null,null,null,null,null,null,null,null,null,null,null,null,null,null,null,null,null,null,null,null,null,"Nom du candidat:",null,null,null,null,null,null,{"$f":"IF(INDEX((Bilan!B5:B34),(MATCH(RIGHT(CELL(\"nomfichier\",A1),LEN(CELL(\"nomfichier\",A1))-FIND(\"]\",CELL(\"nomfichier\",A1))),Bilan!H5:H34,0)))=\"\",\"\",INDEX((Bilan!B5:B34),(MATCH(RIGHT(CELL(\"nomfichier\",A1),LEN(CELL(\"nomfichier\",A1))-FIND(\"]\",CELL(\"nomfichier\",A1))),Bilan!H5:H34,0))))","v":{"$error":"#N/A"}}]
[null,null,null,null,null,null,null,null,null,null,null,null,null,null,null,null,null,null,null,null,null,null,null,"Prénom : "]
[null,null,null,null,null,null,null,null,null,null,null,null,null,null,null,null,null,null,null,null,null,null,null,"Date de l'évaluation:",null,null,null,null,null,null,null,null,null,null,null,null,null,null,null,null,null,null,null,null,null,null,null,"Choisisser votre situation"]
["Lieu d’évaluation :"]
["      Etablissement"]
["      Entreprise :       "]
["Description sommaire du travail demandé :"]
[{"$f":"IF($AV$7=\"\",\"\",IF($AV$7=\"A\",IF(U32_A!A11=\"\",\"\",U32_A!A11),IF($AV$7=\"B\",IF(U32_B!A11=\"\",\"\",U32_B!A11),IF($AV$7=\"C\",IF(U32_C!A11=\"\",\"\",U32_C!A11),IF($AV$7=\"D\",IF(U32_D!A11=\"\",\"\",U32_D!A11),IF($AV$7=\"E\",IF(U32_E!A11=\"\",\"\",U32_E!A11),IF($AV$7=\"F\",IF(U32_F!A11=\"\",\"\",U32_F!A11),IF($AV$7=\"G\",IF(U32_G!A11=\"\",\"\",U32_G!A11),IF($AV$7=\"H\",IF(U32_H!A11=\"\",\"\",U32_H!A11),\"\")))))))))","v":""},{"$f":"IF($AV$7=\"\",\"\",IF($AV$7=\"A\",IF(U32_A!B11=\"\",\"\",U32_A!B11),IF($AV$7=\"B\",IF(U32_B!B11=\"\",\"\",U32_B!B11),IF($AV$7=\"C\",IF(U32_C!B11=\"\",\"\",U32_C!B11),IF($AV$7=\"D\",IF(U32_D!B11=\"\",\"\",U32_D!B11),IF($AV$7=\"E\",IF(U32_E!B11=\"\",\"\",U32_E!B11),IF($AV$7=\"F\",IF(U32_F!B11=\"\",\"\",U32_F!B11),IF($AV$7=\"G\",IF(U32_G!B11=\"\",\"\",U32_G!B11),IF($AV$7=\"H\",IF(U32_H!B11=\"\",\"\",U32_H!B11),\"\")))))))))","v":""},{"$f":"IF($AV$7=\"\",\"\",IF($AV$7=\"A\",IF(U32_A!C11=\"\",\"\",U32_A!C11),IF($AV$7=\"B\",IF(U32_B!C11=\"\",\"\",U32_B!C11),IF($AV$7=\"C\",IF(U32_C!C11=\"\",\"\",U32_C!C11),IF($AV$7=\"D\",IF(U32_D!C11=\"\",\"\",U32_D!C11),IF($AV$7=\"E\",IF(U32_E!C11=\"\",\"\",U32_E!C11),IF($AV$7=\"F\",IF(U32_F!C11=\"\",\"\",U32_F!C11),IF($AV$7=\"G\",IF(U32_G!C11=\"\",\"\",U32_G!C11),IF($AV$7=\"H\",IF(U32_H!C11=\"\",\"\",U32_H!C11),\"\")))))))))","v":""},{"$f":"IF($AV$7=\"\",\"\",IF($AV$7=\"A\",IF(U32_A!D11=\"\",\"\",U32_A!D11),IF($AV$7=\"B\",IF(U32_B!D11=\"\",\"\",U32_B!D11),IF($AV$7=\"C\",IF(U32_C!D11=\"\",\"\",U32_C!D11),IF($AV$7=\"D\",IF(U32_D!D11=\"\",\"\",U32_D!D11),IF($AV$7=\"E\",IF(U32_E!D11=\"\",\"\",U32_E!D11),IF($AV$7=\"F\",IF(U32_F!D11=\"\",\"\",U32_F!D11),IF($AV$7=\"G\",IF(U32_G!D11=\"\",\"\",U32_G!D11),IF($AV$7=\"H\",IF(U32_H!D11=\"\",\"\",U32_H!D11),\"\")))))))))","v":""},{"$f":"IF($AV$7=\"\",\"\",IF($AV$7=\"A\",IF(U32_A!E11=\"\",\"\",U32_A!E11),IF($AV$7=\"B\",IF(U32_B!E11=\"\",\"\",U32_B!E11),IF($AV$7=\"C\",IF(U32_C!E11=\"\",\"\",U32_C!E11),IF($AV$7=\"D\",IF(U32_D!E11=\"\",\"\",U32_D!E11),IF($AV$7=\"E\",IF(U32_E!E11=\"\",\"\",U32_E!E11),IF($AV$7=\"F\",IF(U32_F!E11=\"\",\"\",U32_F!E11),IF($AV$7=\"G\",IF(U32_G!E11=\"\",\"\",U32_G!E11),IF($AV$7=\"H\",IF(U32_H!E11=\"\",\"\",U32_H!E11),\"\")))))))))","v":""},{"$f":"IF($AV$7=\"\",\"\",IF($AV$7=\"A\",IF(U32_A!F11=\"\",\"\",U32_A!F11),IF($AV$7=\"B\",IF(U32_B!F11=\"\",\"\",U32_B!F11),IF($AV$7=\"C\",IF(U32_C!F11=\"\",\"\",U32_C!F11),IF($AV$7=\"D\",IF(U32_D!F11=\"\",\"\",U32_D!F11),IF($AV$7=\"E\",IF(U32_E!F11=\"\",\"\",U32_E!F11),IF($AV$7=\"F\",IF(U32_F!F11=\"\",\"\",U32_F!F11),IF($AV$7=\"G\",IF(U32_G!F11=\"\",\"\",U32_G!F11),IF($AV$7=\"H\",IF(U32_H!F11=\"\",\"\",U32_H!F11),\"\")))))))))","v":""},{"$f":"IF($AV$7=\"\",\"\",IF($AV$7=\"A\",IF(U32_A!G11=\"\",\"\",U32_A!G11),IF($AV$7=\"B\",IF(U32_B!G11=\"\",\"\",U32_B!G11),IF($AV$7=\"C\",IF(U32_C!G11=\"\",\"\",U32_C!G11),IF($AV$7=\"D\",IF(U32_D!G11=\"\",\"\",U32_D!G11),IF($AV$7=\"E\",IF(U32_E!G11=\"\",\"\",U32_E!G11),IF($AV$7=\"F\",IF(U32_F!G11=\"\",\"\",U32_F!G11),IF($AV$7=\"G\",IF(U32_G!G11=\"\",\"\",U32_G!G11),IF($AV$7=\"H\",IF(U32_H!G11=\"\",\"\",U32_H!G11),\"\")))))))))","v":""},{"$f":"IF($AV$7=\"\",\"\",IF($AV$7=\"A\",IF(U32_A!H11=\"\",\"\",U32_A!H11),IF($AV$7=\"B\",IF(U32_B!H11=\"\",\"\",U32_B!H11),IF($AV$7=\"C\",IF(U32_C!H11=\"\",\"\",U32_C!H11),IF($AV$7=\"D\",IF(U32_D!H11=\"\",\"\",U32_D!H11),IF($AV$7=\"E\",IF(U32_E!H11=\"\",\"\",U32_E!H11),IF($AV$7=\"F\",IF(U32_F!H11=\"\",\"\",U32_F!H11),IF($AV$7=\"G\",IF(U32_G!H11=\"\",\"\",U32_G!H11),IF($AV$7=\"H\",IF(U32_H!H11=\"\",\"\",U32_H!H11),\"\")))))))))","v":""},{"$f":"IF($AV$7=\"\",\"\",IF($AV$7=\"A\",IF(U32_A!I11=\"\",\"\",U32_A!I11),IF($AV$7=\"B\",IF(U32_B!I11=\"\",\"\",U32_B!I11),IF($AV$7=\"C\",IF(U32_C!I11=\"\",\"\",U32_C!I11),IF($AV$7=\"D\",IF(U32_D!I11=\"\",\"\",U32_D!I11),IF($AV$7=\"E\",IF(U32_E!I11=\"\",\"\",U32_E!I11),IF($AV$7=\"F\",IF(U32_F!I11=\"\",\"\",U32_F!I11),IF($AV$7=\"G\",IF(U32_G!I11=\"\",\"\",U32_G!I11),IF($AV$7=\"H\",IF(U32_H!I11=\"\",\"\",U32_H!I11),\"\")))))))))","v":""},{"$f":"IF($AV$7=\"\",\"\",IF($AV$7=\"A\",IF(U32_A!J11=\"\",\"\",U32_A!J11),IF($AV$7=\"B\",IF(U32_B!J11=\"\",\"\",U32_B!J11),IF($AV$7=\"C\",IF(U32_C!J11=\"\",\"\",U32_C!J11),IF($AV$7=\"D\",IF(U32_D!J11=\"\",\"\",U32_D!J11),IF($AV$7=\"E\",IF(U32_E!J11=\"\",\"\",U32_E!J11),IF($AV$7=\"F\",IF(U32_F!J11=\"\",\"\",U32_F!J11),IF($AV$7=\"G\",IF(U32_G!J11=\"\",\"\",U32_G!J11),IF($AV$7=\"H\",IF(U32_H!J11=\"\",\"\",U32_H!J11),\"\")))))))))","v":""},{"$f":"IF($AV$7=\"\",\"\",IF($AV$7=\"A\",IF(U32_A!K11=\"\",\"\",U32_A!K11),IF($AV$7=\"B\",IF(U32_B!K11=\"\",\"\",U32_B!K11),IF($AV$7=\"C\",IF(U32_C!K11=\"\",\"\",U32_C!K11),IF($AV$7=\"D\",IF(U32_D!K11=\"\",\"\",U32_D!K11),IF($AV$7=\"E\",IF(U32_E!K11=\"\",\"\",U32_E!K11),IF($AV$7=\"F\",IF(U32_F!K11=\"\",\"\",U32_F!K11),IF($AV$7=\"G\",IF(U32_G!K11=\"\",\"\",U32_G!K11),IF($AV$7=\"H\",IF(U32_H!K11=\"\",\"\",U32_H!K11),\"\")))))))))","v":""},{"$f":"IF($AV$7=\"\",\"\",IF($AV$7=\"A\",IF(U32_A!L11=\"\",\"\",U32_A!L11),IF($AV$7=\"B\",IF(U32_B!L11=\"\",\"\",U32_B!L11),IF($AV$7=\"C\",IF(U32_C!L11=\"\",\"\",U32_C!L11),IF($AV$7=\"D\",IF(U32_D!L11=\"\",\"\",U32_D!L11),IF($AV$7=\"E\",IF(U32_E!L11=\"\",\"\",U32_E!L11),IF($AV$7=\"F\",IF(U32_F!L11=\"\",\"\",U32_F!L11),IF($AV$7=\"G\",IF(U32_G!L11=\"\",\"\",U32_G!L11),IF($AV$7=\"H\",IF(U32_H!L11=\"\",\"\",U32_H!L11),\"\")))))))))","v":""},{"$f":"IF($AV$7=\"\",\"\",IF($AV$7=\"A\",IF(U32_A!M11=\"\",\"\",U32_A!M11),IF($AV$7=\"B\",IF(U32_B!M11=\"\",\"\",U32_B!M11),IF($AV$7=\"C\",IF(U32_C!M11=\"\",\"\",U32_C!M11),IF($AV$7=\"D\",IF(U32_D!M11=\"\",\"\",U32_D!M11),IF($AV$7=\"E\",IF(U32_E!M11=\"\",\"\",U32_E!M11),IF($AV$7=\"F\",IF(U32_F!M11=\"\",\"\",U32_F!M11),IF($AV$7=\"G\",IF(U32_G!M11=\"\",\"\",U32_G!M11),IF($AV$7=\"H\",IF(U32_H!M11=\"\",\"\",U32_H!M11),\"\")))))))))","v":""},{"$f":"IF($AV$7=\"\",\"\",IF($AV$7=\"A\",IF(U32_A!N11=\"\",\"\",U32_A!N11),IF($AV$7=\"B\",IF(U32_B!N11=\"\",\"\",U32_B!N11),IF($AV$7=\"C\",IF(U32_C!N11=\"\",\"\",U32_C!N11),IF($AV$7=\"D\",IF(U32_D!N11=\"\",\"\",U32_D!N11),IF($AV$7=\"E\",IF(U32_E!N11=\"\",\"\",U32_E!N11),IF($AV$7=\"F\",IF(U32_F!N11=\"\",\"\",U32_F!N11),IF($AV$7=\"G\",IF(U32_G!N11=\"\",\"\",U32_G!N11),IF($AV$7=\"H\",IF(U32_H!N11=\"\",\"\",U32_H!N11),\"\")))))))))","v":""},{"$f":"IF($AV$7=\"\",\"\",IF($AV$7=\"A\",IF(U32_A!O11=\"\",\"\",U32_A!O11),IF($AV$7=\"B\",IF(U32_B!O11=\"\",\"\",U32_B!O11),IF($AV$7=\"C\",IF(U32_C!O11=\"\",\"\",U32_C!O11),IF($AV$7=\"D\",IF(U32_D!O11=\"\",\"\",U32_D!O11),IF($AV$7=\"E\",IF(U32_E!O11=\"\",\"\",U32_E!O11),IF($AV$7=\"F\",IF(U32_F!O11=\"\",\"\",U32_F!O11),IF($AV$7=\"G\",IF(U32_G!O11=\"\",\"\",U32_G!O11),IF($AV$7=\"H\",IF(U32_H!O11=\"\",\"\",U32_H!O11),\"\")))))))))","v":""},{"$f":"IF($AV$7=\"\",\"\",IF($AV$7=\"A\",IF(U32_A!P11=\"\",\"\",U32_A!P11),IF($AV$7=\"B\",IF(U32_B!P11=\"\",\"\",U32_B!P11),IF($AV$7=\"C\",IF(U32_C!P11=\"\",\"\",U32_C!P11),IF($AV$7=\"D\",IF(U32_D!P11=\"\",\"\",U32_D!P11),IF($AV$7=\"E\",IF(U32_E!P11=\"\",\"\",U32_E!P11),IF($AV$7=\"F\",IF(U32_F!P11=\"\",\"\",U32_F!P11),IF($AV$7=\"G\",IF(U32_G!P11=\"\",\"\",U32_G!P11),IF($AV$7=\"H\",IF(U32_H!P11=\"\",\"\",U32_H!P11),\"\")))))))))","v":""},{"$f":"IF($AV$7=\"\",\"\",IF($AV$7=\"A\",IF(U32_A!Q11=\"\",\"\",U32_A!Q11),IF($AV$7=\"B\",IF(U32_B!Q11=\"\",\"\",U32_B!Q11),IF($AV$7=\"C\",IF(U32_C!Q11=\"\",\"\",U32_C!Q11),IF($AV$7=\"D\",IF(U32_D!Q11=\"\",\"\",U32_D!Q11),IF($AV$7=\"E\",IF(U32_E!Q11=\"\",\"\",U32_E!Q11),IF($AV$7=\"F\",IF(U32_F!Q11=\"\",\"\",U32_F!Q11),IF($AV$7=\"G\",IF(U32_G!Q11=\"\",\"\",U32_G!Q11),IF($AV$7=\"H\",IF(U32_H!Q11=\"\",\"\",U32_H!Q11),\"\")))))))))","v":""},{"$f":"IF($AV$7=\"\",\"\",IF($AV$7=\"A\",IF(U32_A!R11=\"\",\"\",U32_A!R11),IF($AV$7=\"B\",IF(U32_B!R11=\"\",\"\",U32_B!R11),IF($AV$7=\"C\",IF(U32_C!R11=\"\",\"\",U32_C!R11),IF($AV$7=\"D\",IF(U32_D!R11=\"\",\"\",U32_D!R11),IF($AV$7=\"E\",IF(U32_E!R11=\"\",\"\",U32_E!R11),IF($AV$7=\"F\",IF(U32_F!R11=\"\",\"\",U32_F!R11),IF($AV$7=\"G\",IF(U32_G!R11=\"\",\"\",U32_G!R11),IF($AV$7=\"H\",IF(U32_H!R11=\"\",\"\",U32_H!R11),\"\")))))))))","v":""},{"$f":"IF($AV$7=\"\",\"\",IF($AV$7=\"A\",IF(U32_A!S11=\"\",\"\",U32_A!S11),IF($AV$7=\"B\",IF(U32_B!S11=\"\",\"\",U32_B!S11),IF($AV$7=\"C\",IF(U32_C!S11=\"\",\"\",U32_C!S11),IF($AV$7=\"D\",IF(U32_D!S11=\"\",\"\",U32_D!S11),IF($AV$7=\"E\",IF(U32_E!S11=\"\",\"\",U32_E!S11),IF($AV$7=\"F\",IF(U32_F!S11=\"\",\"\",U32_F!S11),IF($AV$7=\"G\",IF(U32_G!S11=\"\",\"\",U32_G!S11),IF($AV$7=\"H\",IF(U32_H!S11=\"\",\"\",U32_H!S11),\"\")))))))))","v":""},{"$f":"IF($AV$7=\"\",\"\",IF($AV$7=\"A\",IF(U32_A!T11=\"\",\"\",U32_A!T11),IF($AV$7=\"B\",IF(U32_B!T11=\"\",\"\",U32_B!T11),IF($AV$7=\"C\",IF(U32_C!T11=\"\",\"\",U32_C!T11),IF($AV$7=\"D\",IF(U32_D!T11=\"\",\"\",U32_D!T11),IF($AV$7=\"E\",IF(U32_E!T11=\"\",\"\",U32_E!T11),IF($AV$7=\"F\",IF(U32_F!T11=\"\",\"\",U32_F!T11),IF($AV$7=\"G\",IF(U32_G!T11=\"\",\"\",U32_G!T11),IF($AV$7=\"H\",IF(U32_H!T11=\"\",\"\",U32_H!T11),\"\")))))))))","v":""},{"$f":"IF($AV$7=\"\",\"\",IF($AV$7=\"A\",IF(U32_A!U11=\"\",\"\",U32_A!U11),IF($AV$7=\"B\",IF(U32_B!U11=\"\",\"\",U32_B!U11),IF($AV$7=\"C\",IF(U32_C!U11=\"\",\"\",U32_C!U11),IF($AV$7=\"D\",IF(U32_D!U11=\"\",\"\",U32_D!U11),IF($AV$7=\"E\",IF(U32_E!U11=\"\",\"\",U32_E!U11),IF($AV$7=\"F\",IF(U32_F!U11=\"\",\"\",U32_F!U11),IF($AV$7=\"G\",IF(U32_G!U11=\"\",\"\",U32_G!U11),IF($AV$7=\"H\",IF(U32_H!U11=\"\",\"\",U32_H!U11),\"\")))))))))","v":""},{"$f":"IF($AV$7=\"\",\"\",IF($AV$7=\"A\",IF(U32_A!V11=\"\",\"\",U32_A!V11),IF($AV$7=\"B\",IF(U32_B!V11=\"\",\"\",U32_B!V11),IF($AV$7=\"C\",IF(U32_C!V11=\"\",\"\",U32_C!V11),IF($AV$7=\"D\",IF(U32_D!V11=\"\",\"\",U32_D!V11),IF($AV$7=\"E\",IF(U32_E!V11=\"\",\"\",U32_E!V11),IF($AV$7=\"F\",IF(U32_F!V11=\"\",\"\",U32_F!V11),IF($AV$7=\"G\",IF(U32_G!V11=\"\",\"\",U32_G!V11),IF($AV$7=\"H\",IF(U32_H!V11=\"\",\"\",U32_H!V11),\"\")))))))))","v":""},{"$f":"IF($AV$7=\"\",\"\",IF($AV$7=\"A\",IF(U32_A!W11=\"\",\"\",U32_A!W11),IF($AV$7=\"B\",IF(U32_B!W11=\"\",\"\",U32_B!W11),IF($AV$7=\"C\",IF(U32_C!W11=\"\",\"\",U32_C!W11),IF($AV$7=\"D\",IF(U32_D!W11=\"\",\"\",U32_D!W11),IF($AV$7=\"E\",IF(U32_E!W11=\"\",\"\",U32_E!W11),IF($AV$7=\"F\",IF(U32_F!W11=\"\",\"\",U32_F!W11),IF($AV$7=\"G\",IF(U32_G!W11=\"\",\"\",U32_G!W11),IF($AV$7=\"H\",IF(U32_H!W11=\"\",\"\",U32_H!W11),\"\")))))))))","v":""},{"$f":"IF($AV$7=\"\",\"\",IF($AV$7=\"A\",IF(U32_A!X11=\"\",\"\",U32_A!X11),IF($AV$7=\"B\",IF(U32_B!X11=\"\",\"\",U32_B!X11),IF($AV$7=\"C\",IF(U32_C!X11=\"\",\"\",U32_C!X11),IF($AV$7=\"D\",IF(U32_D!X11=\"\",\"\",U32_D!X11),IF($AV$7=\"E\",IF(U32_E!X11=\"\",\"\",U32_E!X11),IF($AV$7=\"F\",IF(U32_F!X11=\"\",\"\",U32_F!X11),IF($AV$7=\"G\",IF(U32_G!X11=\"\",\"\",U32_G!X11),IF($AV$7=\"H\",IF(U32_H!X11=\"\",\"\",U32_H!X11),\"\")))))))))","v":""},{"$f":"IF($AV$7=\"\",\"\",IF($AV$7=\"A\",IF(U32_A!Y11=\"\",\"\",U32_A!Y11),IF($AV$7=\"B\",IF(U32_B!Y11=\"\",\"\",U32_B!Y11),IF($AV$7=\"C\",IF(U32_C!Y11=\"\",\"\",U32_C!Y11),IF($AV$7=\"D\",IF(U32_D!Y11=\"\",\"\",U32_D!Y11),IF($AV$7=\"E\",IF(U32_E!Y11=\"\",\"\",U32_E!Y11),IF($AV$7=\"F\",IF(U32_F!Y11=\"\",\"\",U32_F!Y11),IF($AV$7=\"G\",IF(U32_G!Y11=\"\",\"\",U32_G!Y11),IF($AV$7=\"H\",IF(U32_H!Y11=\"\",\"\",U32_H!Y11),\"\")))))))))","v":""},{"$f":"IF($AV$7=\"\",\"\",IF($AV$7=\"A\",IF(U32_A!Z11=\"\",\"\",U32_A!Z11),IF($AV$7=\"B\",IF(U32_B!Z11=\"\",\"\",U32_B!Z11),IF($AV$7=\"C\",IF(U32_C!Z11=\"\",\"\",U32_C!Z11),IF($AV$7=\"D\",IF(U32_D!Z11=\"\",\"\",U32_D!Z11),IF($AV$7=\"E\",IF(U32_E!Z11=\"\",\"\",U32_E!Z11),IF($AV$7=\"F\",IF(U32_F!Z11=\"\",\"\",U32_F!Z11),IF($AV$7=\"G\",IF(U32_G!Z11=\"\",\"\",U32_G!Z11),IF($AV$7=\"H\",IF(U32_H!Z11=\"\",\"\",U32_H!Z11),\"\")))))))))","v":""},{"$f":"IF($AV$7=\"\",\"\",IF($AV$7=\"A\",IF(U32_A!AA11=\"\",\"\",U32_A!AA11),IF($AV$7=\"B\",IF(U32_B!AA11=\"\",\"\",U32_B!AA11),IF($AV$7=\"C\",IF(U32_C!AA11=\"\",\"\",U32_C!AA11),IF($AV$7=\"D\",IF(U32_D!AA11=\"\",\"\",U32_D!AA11),IF($AV$7=\"E\",IF(U32_E!AA11=\"\",\"\",U32_E!AA11),IF($AV$7=\"F\",IF(U32_F!AA11=\"\",\"\",U32_F!AA11),IF($AV$7=\"G\",IF(U32_G!AA11=\"\",\"\",U32_G!AA11),IF($AV$7=\"H\",IF(U32_H!AA11=\"\",\"\",U32_H!AA11),\"\")))))))))","v":""},{"$f":"IF($AV$7=\"\",\"\",IF($AV$7=\"A\",IF(U32_A!AB11=\"\",\"\",U32_A!AB11),IF($AV$7=\"B\",IF(U32_B!AB11=\"\",\"\",U32_B!AB11),IF($AV$7=\"C\",IF(U32_C!AB11=\"\",\"\",U32_C!AB11),IF($AV$7=\"D\",IF(U32_D!AB11=\"\",\"\",U32_D!AB11),IF($AV$7=\"E\",IF(U32_E!AB11=\"\",\"\",U32_E!AB11),IF($AV$7=\"F\",IF(U32_F!AB11=\"\",\"\",U32_F!AB11),IF($AV$7=\"G\",IF(U32_G!AB11=\"\",\"\",U32_G!AB11),IF($AV$7=\"H\",IF(U32_H!AB11=\"\",\"\",U32_H!AB11),\"\")))))))))","v":""},{"$f":"IF($AV$7=\"\",\"\",IF($AV$7=\"A\",IF(U32_A!AC11=\"\",\"\",U32_A!AC11),IF($AV$7=\"B\",IF(U32_B!AC11=\"\",\"\",U32_B!AC11),IF($AV$7=\"C\",IF(U32_C!AC11=\"\",\"\",U32_C!AC11),IF($AV$7=\"D\",IF(U32_D!AC11=\"\",\"\",U32_D!AC11),IF($AV$7=\"E\",IF(U32_E!AC11=\"\",\"\",U32_E!AC11),IF($AV$7=\"F\",IF(U32_F!AC11=\"\",\"\",U32_F!AC11),IF($AV$7=\"G\",IF(U32_G!AC11=\"\",\"\",U32_G!AC11),IF($AV$7=\"H\",IF(U32_H!AC11=\"\",\"\",U32_H!AC11),\"\")))))))))","v":""},{"$f":"IF($AV$7=\"\",\"\",IF($AV$7=\"A\",IF(U32_A!AD11=\"\",\"\",U32_A!AD11),IF($AV$7=\"B\",IF(U32_B!AD11=\"\",\"\",U32_B!AD11),IF($AV$7=\"C\",IF(U32_C!AD11=\"\",\"\",U32_C!AD11),IF($AV$7=\"D\",IF(U32_D!AD11=\"\",\"\",U32_D!AD11),IF($AV$7=\"E\",IF(U32_E!AD11=\"\",\"\",U32_E!AD11),IF($AV$7=\"F\",IF(U32_F!AD11=\"\",\"\",U32_F!AD11),IF($AV$7=\"G\",IF(U32_G!AD11=\"\",\"\",U32_G!AD11),IF($AV$7=\"H\",IF(U32_H!AD11=\"\",\"\",U32_H!AD11),\"\")))))))))","v":""},{"$f":"IF($AV$7=\"\",\"\",IF($AV$7=\"A\",IF(U32_A!AE11=\"\",\"\",U32_A!AE11),IF($AV$7=\"B\",IF(U32_B!AE11=\"\",\"\",U32_B!AE11),IF($AV$7=\"C\",IF(U32_C!AE11=\"\",\"\",U32_C!AE11),IF($AV$7=\"D\",IF(U32_D!AE11=\"\",\"\",U32_D!AE11),IF($AV$7=\"E\",IF(U32_E!AE11=\"\",\"\",U32_E!AE11),IF($AV$7=\"F\",IF(U32_F!AE11=\"\",\"\",U32_F!AE11),IF($AV$7=\"G\",IF(U32_G!AE11=\"\",\"\",U32_G!AE11),IF($AV$7=\"H\",IF(U32_H!AE11=\"\",\"\",U32_H!AE11),\"\")))))))))","v":""},{"$f":"IF($AV$7=\"\",\"\",IF($AV$7=\"A\",IF(U32_A!AF11=\"\",\"\",U32_A!AF11),IF($AV$7=\"B\",IF(U32_B!AF11=\"\",\"\",U32_B!AF11),IF($AV$7=\"C\",IF(U32_C!AF11=\"\",\"\",U32_C!AF11),IF($AV$7=\"D\",IF(U32_D!AF11=\"\",\"\",U32_D!AF11),IF($AV$7=\"E\",IF(U32_E!AF11=\"\",\"\",U32_E!AF11),IF($AV$7=\"F\",IF(U32_F!AF11=\"\",\"\",U32_F!AF11),IF($AV$7=\"G\",IF(U32_G!AF11=\"\",\"\",U32_G!AF11),IF($AV$7=\"H\",IF(U32_H!AF11=\"\",\"\",U32_H!AF11),\"\")))))))))","v":""},{"$f":"IF($AV$7=\"\",\"\",IF($AV$7=\"A\",IF(U32_A!AG11=\"\",\"\",U32_A!AG11),IF($AV$7=\"B\",IF(U32_B!AG11=\"\",\"\",U32_B!AG11),IF($AV$7=\"C\",IF(U32_C!AG11=\"\",\"\",U32_C!AG11),IF($AV$7=\"D\",IF(U32_D!AG11=\"\",\"\",U32_D!AG11),IF($AV$7=\"E\",IF(U32_E!AG11=\"\",\"\",U32_E!AG11),IF($AV$7=\"F\",IF(U32_F!AG11=\"\",\"\",U32_F!AG11),IF($AV$7=\"G\",IF(U32_G!AG11=\"\",\"\",U32_G!AG11),IF($AV$7=\"H\",IF(U32_H!AG11=\"\",\"\",U32_H!AG11),\"\")))))))))","v":""},{"$f":"IF($AV$7=\"\",\"\",IF($AV$7=\"A\",IF(U32_A!AH11=\"\",\"\",U32_A!AH11),IF($AV$7=\"B\",IF(U32_B!AH11=\"\",\"\",U32_B!AH11),IF($AV$7=\"C\",IF(U32_C!AH11=\"\",\"\",U32_C!AH11),IF($AV$7=\"D\",IF(U32_D!AH11=\"\",\"\",U32_D!AH11),IF($AV$7=\"E\",IF(U32_E!AH11=\"\",\"\",U32_E!AH11),IF($AV$7=\"F\",IF(U32_F!AH11=\"\",\"\",U32_F!AH11),IF($AV$7=\"G\",IF(U32_G!AH11=\"\",\"\",U32_G!AH11),IF($AV$7=\"H\",IF(U32_H!AH11=\"\",\"\",U32_H!AH11),\"\")))))))))","v":""},{"$f":"IF($AV$7=\"\",\"\",IF($AV$7=\"A\",IF(U32_A!AI11=\"\",\"\",U32_A!AI11),IF($AV$7=\"B\",IF(U32_B!AI11=\"\",\"\",U32_B!AI11),IF($AV$7=\"C\",IF(U32_C!AI11=\"\",\"\",U32_C!AI11),IF($AV$7=\"D\",IF(U32_D!AI11=\"\",\"\",U32_D!AI11),IF($AV$7=\"E\",IF(U32_E!AI11=\"\",\"\",U32_E!AI11),IF($AV$7=\"F\",IF(U32_F!AI11=\"\",\"\",U32_F!AI11),IF($AV$7=\"G\",IF(U32_G!AI11=\"\",\"\",U32_G!AI11),IF($AV$7=\"H\",IF(U32_H!AI11=\"\",\"\",U32_H!AI11),\"\")))))))))","v":""},{"$f":"IF($AV$7=\"\",\"\",IF($AV$7=\"A\",IF(U32_A!AJ11=\"\",\"\",U32_A!AJ11),IF($AV$7=\"B\",IF(U32_B!AJ11=\"\",\"\",U32_B!AJ11),IF($AV$7=\"C\",IF(U32_C!AJ11=\"\",\"\",U32_C!AJ11),IF($AV$7=\"D\",IF(U32_D!AJ11=\"\",\"\",U32_D!AJ11),IF($AV$7=\"E\",IF(U32_E!AJ11=\"\",\"\",U32_E!AJ11),IF($AV$7=\"F\",IF(U32_F!AJ11=\"\",\"\",U32_F!AJ11),IF($AV$7=\"G\",IF(U32_G!AJ11=\"\",\"\",U32_G!AJ11),IF($AV$7=\"H\",IF(U32_H!AJ11=\"\",\"\",U32_H!AJ11),\"\")))))))))","v":""},{"$f":"IF($AV$7=\"\",\"\",IF($AV$7=\"A\",IF(U32_A!AK11=\"\",\"\",U32_A!AK11),IF($AV$7=\"B\",IF(U32_B!AK11=\"\",\"\",U32_B!AK11),IF($AV$7=\"C\",IF(U32_C!AK11=\"\",\"\",U32_C!AK11),IF($AV$7=\"D\",IF(U32_D!AK11=\"\",\"\",U32_D!AK11),IF($AV$7=\"E\",IF(U32_E!AK11=\"\",\"\",U32_E!AK11),IF($AV$7=\"F\",IF(U32_F!AK11=\"\",\"\",U32_F!AK11),IF($AV$7=\"G\",IF(U32_G!AK11=\"\",\"\",U32_G!AK11),IF($AV$7=\"H\",IF(U32_H!AK11=\"\",\"\",U32_H!AK11),\"\")))))))))","v":""},{"$f":"IF($AV$7=\"\",\"\",IF($AV$7=\"A\",IF(U32_A!AL11=\"\",\"\",U32_A!AL11),IF($AV$7=\"B\",IF(U32_B!AL11=\"\",\"\",U32_B!AL11),IF($AV$7=\"C\",IF(U32_C!AL11=\"\",\"\",U32_C!AL11),IF($AV$7=\"D\",IF(U32_D!AL11=\"\",\"\",U32_D!AL11),IF($AV$7=\"E\",IF(U32_E!AL11=\"\",\"\",U32_E!AL11),IF($AV$7=\"F\",IF(U32_F!AL11=\"\",\"\",U32_F!AL11),IF($AV$7=\"G\",IF(U32_G!AL11=\"\",\"\",U32_G!AL11),IF($AV$7=\"H\",IF(U32_H!AL11=\"\",\"\",U32_H!AL11),\"\")))))))))","v":""},{"$f":"IF($AV$7=\"\",\"\",IF($AV$7=\"A\",IF(U32_A!AM11=\"\",\"\",U32_A!AM11),IF($AV$7=\"B\",IF(U32_B!AM11=\"\",\"\",U32_B!AM11),IF($AV$7=\"C\",IF(U32_C!AM11=\"\",\"\",U32_C!AM11),IF($AV$7=\"D\",IF(U32_D!AM11=\"\",\"\",U32_D!AM11),IF($AV$7=\"E\",IF(U32_E!AM11=\"\",\"\",U32_E!AM11),IF($AV$7=\"F\",IF(U32_F!AM11=\"\",\"\",U32_F!AM11),IF($AV$7=\"G\",IF(U32_G!AM11=\"\",\"\",U32_G!AM11),IF($AV$7=\"H\",IF(U32_H!AM11=\"\",\"\",U32_H!AM11),\"\")))))))))","v":""},{"$f":"IF($AV$7=\"\",\"\",IF($AV$7=\"A\",IF(U32_A!AN11=\"\",\"\",U32_A!AN11),IF($AV$7=\"B\",IF(U32_B!AN11=\"\",\"\",U32_B!AN11),IF($AV$7=\"C\",IF(U32_C!AN11=\"\",\"\",U32_C!AN11),IF($AV$7=\"D\",IF(U32_D!AN11=\"\",\"\",U32_D!AN11),IF($AV$7=\"E\",IF(U32_E!AN11=\"\",\"\",U32_E!AN11),IF($AV$7=\"F\",IF(U32_F!AN11=\"\",\"\",U32_F!AN11),IF($AV$7=\"G\",IF(U32_G!AN11=\"\",\"\",U32_G!AN11),IF($AV$7=\"H\",IF(U32_H!AN11=\"\",\"\",U32_H!AN11),\"\")))))))))","v":""},{"$f":"IF($AV$7=\"\",\"\",IF($AV$7=\"A\",IF(U32_A!AO11=\"\",\"\",U32_A!AO11),IF($AV$7=\"B\",IF(U32_B!AO11=\"\",\"\",U32_B!AO11),IF($AV$7=\"C\",IF(U32_C!AO11=\"\",\"\",U32_C!AO11),IF($AV$7=\"D\",IF(U32_D!AO11=\"\",\"\",U32_D!AO11),IF($AV$7=\"E\",IF(U32_E!AO11=\"\",\"\",U32_E!AO11),IF($AV$7=\"F\",IF(U32_F!AO11=\"\",\"\",U32_F!AO11),IF($AV$7=\"G\",IF(U32_G!AO11=\"\",\"\",U32_G!AO11),IF($AV$7=\"H\",IF(U32_H!AO11=\"\",\"\",U32_H!AO11),\"\")))))))))","v":""},{"$f":"IF($AV$7=\"\",\"\",IF($AV$7=\"A\",IF(U32_A!AP11=\"\",\"\",U32_A!AP11),IF($AV$7=\"B\",IF(U32_B!AP11=\"\",\"\",U32_B!AP11),IF($AV$7=\"C\",IF(U32_C!AP11=\"\",\"\",U32_C!AP11),IF($AV$7=\"D\",IF(U32_D!AP11=\"\",\"\",U32_D!AP11),IF($AV$7=\"E\",IF(U32_E!AP11=\"\",\"\",U32_E!AP11),IF($AV$7=\"F\",IF(U32_F!AP11=\"\",\"\",U32_F!AP11),IF($AV$7=\"G\",IF(U32_G!AP11=\"\",\"\",U32_G!AP11),IF($AV$7=\"H\",IF(U32_H!AP11=\"\",\"\",U32_H!AP11),\"\")))))))))","v":""},{"$f":"IF($AV$7=\"\",\"\",IF($AV$7=\"A\",IF(U32_A!AQ11=\"\",\"\",U32_A!AQ11),IF($AV$7=\"B\",IF(U32_B!AQ11=\"\",\"\",U32_B!AQ11),IF($AV$7=\"C\",IF(U32_C!AQ11=\"\",\"\",U32_C!AQ11),IF($AV$7=\"D\",IF(U32_D!AQ11=\"\",\"\",U32_D!AQ11),IF($AV$7=\"E\",IF(U32_E!AQ11=\"\",\"\",U32_E!AQ11),IF($AV$7=\"F\",IF(U32_F!AQ11=\"\",\"\",U32_F!AQ11),IF($AV$7=\"G\",IF(U32_G!AQ11=\"\",\"\",U32_G!AQ11),IF($AV$7=\"H\",IF(U32_H!AQ11=\"\",\"\",U32_H!AQ11),\"\")))))))))","v":""},{"$f":"IF($AV$7=\"\",\"\",IF($AV$7=\"A\",IF(U32_A!AR11=\"\",\"\",U32_A!AR11),IF($AV$7=\"B\",IF(U32_B!AR11=\"\",\"\",U32_B!AR11),IF($AV$7=\"C\",IF(U32_C!AR11=\"\",\"\",U32_C!AR11),IF($AV$7=\"D\",IF(U32_D!AR11=\"\",\"\",U32_D!AR11),IF($AV$7=\"E\",IF(U32_E!AR11=\"\",\"\",U32_E!AR11),IF($AV$7=\"F\",IF(U32_F!AR11=\"\",\"\",U32_F!AR11),IF($AV$7=\"G\",IF(U32_G!AR11=\"\",\"\",U32_G!AR11),IF($AV$7=\"H\",IF(U32_H!AR11=\"\",\"\",U32_H!AR11),\"\")))))))))","v":""},{"$f":"IF($AV$7=\"\",\"\",IF($AV$7=\"A\",IF(U32_A!AS11=\"\",\"\",U32_A!AS11),IF($AV$7=\"B\",IF(U32_B!AS11=\"\",\"\",U32_B!AS11),IF($AV$7=\"C\",IF(U32_C!AS11=\"\",\"\",U32_C!AS11),IF($AV$7=\"D\",IF(U32_D!AS11=\"\",\"\",U32_D!AS11),IF($AV$7=\"E\",IF(U32_E!AS11=\"\",\"\",U32_E!AS11),IF($AV$7=\"F\",IF(U32_F!AS11=\"\",\"\",U32_F!AS11),IF($AV$7=\"G\",IF(U32_G!AS11=\"\",\"\",U32_G!AS11),IF($AV$7=\"H\",IF(U32_H!AS11=\"\",\"\",U32_H!AS11),\"\")))))))))","v":""},{"$f":"IF($AV$7=\"\",\"\",IF($AV$7=\"A\",IF(U32_A!AT11=\"\",\"\",U32_A!AT11),IF($AV$7=\"B\",IF(U32_B!AT11=\"\",\"\",U32_B!AT11),IF($AV$7=\"C\",IF(U32_C!AT11=\"\",\"\",U32_C!AT11),IF($AV$7=\"D\",IF(U32_D!AT11=\"\",\"\",U32_D!AT11),IF($AV$7=\"E\",IF(U32_E!AT11=\"\",\"\",U32_E!AT11),IF($AV$7=\"F\",IF(U32_F!AT11=\"\",\"\",U32_F!AT11),IF($AV$7=\"G\",IF(U32_G!AT11=\"\",\"\",U32_G!AT11),IF($AV$7=\"H\",IF(U32_H!AT11=\"\",\"\",U32_H!AT11),\"\")))))))))","v":""}]
[]
["Données fournies au candidat"]
[{"$f":"IF($AV$7=\"\",\"\",IF($AV$7=\"A\",IF(U32_A!A14=\"\",\"\",U32_A!A14),IF($AV$7=\"B\",IF(U32_B!A14=\"\",\"\",U32_B!A14),IF($AV$7=\"C\",IF(U32_C!A14=\"\",\"\",U32_C!A14),IF($AV$7=\"D\",IF(U32_D!A14=\"\",\"\",U32_D!A14),IF($AV$7=\"E\",IF(U32_E!A14=\"\",\"\",U32_E!A14),IF($AV$7=\"F\",IF(U32_F!A14=\"\",\"\",U32_F!A14),IF($AV$7=\"G\",IF(U32_G!A14=\"\",\"\",U32_G!A14),IF($AV$7=\"H\",IF(U32_H!A14=\"\",\"\",U32_H!A14),\"\")))))))))","v":""},"Le bien et les conditions de son environnement",null,null,null,null,null,null,null,null,null,null,null,null,null,null,null,null,null,null,null,null,null,{"$f":"IF($AV$7=\"\",\"\",IF($AV$7=\"A\",IF(U32_A!X14=\"\",\"\",U32_A!X14),IF($AV$7=\"B\",IF(U32_B!X14=\"\",\"\",U32_B!X14),IF($AV$7=\"C\",IF(U32_C!X14=\"\",\"\",U32_C!X14),IF($AV$7=\"D\",IF(U32_D!X14=\"\",\"\",U32_D!X14),IF($AV$7=\"E\",IF(U32_E!X14=\"\",\"\",U32_E!X14),IF($AV$7=\"F\",IF(U32_F!X14=\"\",\"\",U32_F!X14),IF($AV$7=\"G\",IF(U32_G!X14=\"\",\"\",U32_G!X14),IF($AV$7=\"H\",IF(U32_H!X14=\"\",\"\",U32_H!X14),\"\")))))))))","v":""},"Les composants et les conditions de leur environnement"]
[{"$f":"IF($AV$7=\"\",\"\",IF($AV$7=\"A\",IF(U32_A!A15=\"\",\"\",U32_A!A15),IF($AV$7=\"B\",IF(U32_B!A15=\"\",\"\",U32_B!A15),IF($AV$7=\"C\",IF(U32_C!A15=\"\",\"\",U32_C!A15),IF($AV$7=\"D\",IF(U32_D!A15=\"\",\"\",U32_D!A15),IF($AV$7=\"E\",IF(U32_E!A15=\"\",\"\",U32_E!A15),IF($AV$7=\"F\",IF(U32_F!A15=\"\",\"\",U32_F!A15),IF($AV$7=\"G\",IF(U32_G!A15=\"\",\"\",U32_G!A15),IF($AV$7=\"H\",IF(U32_H!A15=\"\",\"\",U32_H!A15),\"\")))))))))","v":""},"Le dossier technique du bien et son dossier de maintenance  sur supports papiers ou supports numériques",null,null,null,null,null,null,null,null,null,null,null,null,null,null,null,null,null,null,null,null,null,{"$f":"IF($AV$7=\"\",\"\",IF($AV$7=\"A\",IF(U32_A!X15=\"\",\"\",U32_A!X15),IF($AV$7=\"B\",IF(U32_B!X15=\"\",\"\",U32_B!X15),IF($AV$7=\"C\",IF(U32_C!X15=\"\",\"\",U32_C!X15),IF($AV$7=\"D\",IF(U32_D!X15=\"\",\"\",U32_D!X15),IF($AV$7=\"E\",IF(U32_E!X15=\"\",\"\",U32_E!X15),IF($AV$7=\"F\",IF(U32_F!X15=\"\",\"\",U32_F!X15),IF($AV$7=\"G\",IF(U32_G!X15=\"\",\"\",U32_G!X15),IF($AV$7=\"H\",IF(U32_H!X15=\"\",\"\",U32_H!X15),\"\")))))))))","v":""},"Toutes informations en provenance de l’utilisateur ou d’autres intervenants"]
[{"$f":"IF($AV$7=\"\",\"\",IF($AV$7=\"A\",IF(U32_A!A16=\"\",\"\",U32_A!A16),IF($AV$7=\"B\",IF(U32_B!A16=\"\",\"\",U32_B!A16),IF($AV$7=\"C\",IF(U32_C!A16=\"\",\"\",U32_C!A16),IF($AV$7=\"D\",IF(U32_D!A16=\"\",\"\",U32_D!A16),IF($AV$7=\"E\",IF(U32_E!A16=\"\",\"\",U32_E!A16),IF($AV$7=\"F\",IF(U32_F!A16=\"\",\"\",U32_F!A16),IF($AV$7=\"G\",IF(U32_G!A16=\"\",\"\",U32_G!A16),IF($AV$7=\"H\",IF(U32_H!A16=\"\",\"\",U32_H!A16),\"\")))))))))","v":""},"Les consignes d’exploitation",null,null,null,null,null,null,null,null,null,null,null,null,null,null,null,null,null,null,null,null,null,{"$f":"IF($AV$7=\"\",\"\",IF($AV$7=\"A\",IF(U32_A!X16=\"\",\"\",U32_A!X16),IF($AV$7=\"B\",IF(U32_B!X16=\"\",\"\",U32_B!X16),IF($AV$7=\"C\",IF(U32_C!X16=\"\",\"\",U32_C!X16),IF($AV$7=\"D\",IF(U32_D!X16=\"\",\"\",U32_D!X16),IF($AV$7=\"E\",IF(U32_E!X16=\"\",\"\",U32_E!X16),IF($AV$7=\"F\",IF(U32_F!X16=\"\",\"\",U32_F!X16),IF($AV$7=\"G\",IF(U32_G!X16=\"\",\"\",U32_G!X16),IF($AV$7=\"H\",IF(U32_H!X16=\"\",\"\",U32_H!X16),\"\")))))))))","v":""},"Les pièces de rechange, les consommables"]
[{"$f":"IF($AV$7=\"\",\"\",IF($AV$7=\"A\",IF(U32_A!A17=\"\",\"\",U32_A!A17),IF($AV$7=\"B\",IF(U32_B!A17=\"\",\"\",U32_B!A17),IF($AV$7=\"C\",IF(U32_C!A17=\"\",\"\",U32_C!A17),IF($AV$7=\"D\",IF(U32_D!A17=\"\",\"\",U32_D!A17),IF($AV$7=\"E\",IF(U32_E!A17=\"\",\"\",U32_E!A17),IF($AV$7=\"F\",IF(U32_F!A17=\"\",\"\",U32_F!A17),IF($AV$7=\"G\",IF(U32_G!A17=\"\",\"\",U32_G!A17),IF($AV$7=\"H\",IF(U32_H!A17=\"\",\"\",U32_H!A17),\"\")))))))))","v":""},"Le bon de travail",null,null,null,null,null,null,null,null,null,null,null,null,null,null,null,null,null,null,null,null,null,{"$f":"IF($AV$7=\"\",\"\",IF($AV$7=\"A\",IF(U32_A!X17=\"\",\"\",U32_A!X17),IF($AV$7=\"B\",IF(U32_B!X17=\"\",\"\",U32_B!X17),IF($AV$7=\"C\",IF(U32_C!X17=\"\",\"\",U32_C!X17),IF($AV$7=\"D\",IF(U32_D!X17=\"\",\"\",U32_D!X17),IF($AV$7=\"E\",IF(U32_E!X17=\"\",\"\",U32_E!X17),IF($AV$7=\"F\",IF(U32_F!X17=\"\",\"\",U32_F!X17),IF($AV$7=\"G\",IF(U32_G!X17=\"\",\"\",U32_G!X17),IF($AV$7=\"H\",IF(U32_H!X17=\"\",\"\",U32_H!X17),\"\")))))))))","v":""},"Les équipements de protection individuels et collectifs"]
[{"$f":"IF($AV$7=\"\",\"\",IF($AV$7=\"A\",IF(U32_A!A18=\"\",\"\",U32_A!A18),IF($AV$7=\"B\",IF(U32_B!A18=\"\",\"\",U32_B!A18),IF($AV$7=\"C\",IF(U32_C!A18=\"\",\"\",U32_C!A18),IF($AV$7=\"D\",IF(U32_D!A18=\"\",\"\",U32_D!A18),IF($AV$7=\"E\",IF(U32_E!A18=\"\",\"\",U32_E!A18),IF($AV$7=\"F\",IF(U32_F!A18=\"\",\"\",U32_F!A18),IF($AV$7=\"G\",IF(U32_G!A18=\"\",\"\",U32_G!A18),IF($AV$7=\"H\",IF(U32_H!A18=\"\",\"\",U32_H!A18),\"\")))))))))","v":""},"Le document unique d’évaluation des risques",null,null,null,null,null,null,null,null,null,null,null,null,null,null,null,null,null,null,null,null,null,{"$f":"IF($AV$7=\"\",\"\",IF($AV$7=\"A\",IF(U32_A!X18=\"\",\"\",U32_A!X18),IF($AV$7=\"B\",IF(U32_B!X18=\"\",\"\",U32_B!X18),IF($AV$7=\"C\",IF(U32_C!X18=\"\",\"\",U32_C!X18),IF($AV$7=\"D\",IF(U32_D!X18=\"\",\"\",U32_D!X18),IF($AV$7=\"E\",IF(U32_E!X18=\"\",\"\",U32_E!X18),IF($AV$7=\"F\",IF(U32_F!X18=\"\",\"\",U32_F!X18),IF($AV$7=\"G\",IF(U32_G!X18=\"\",\"\",U32_G!X18),IF($AV$7=\"H\",IF(U32_H!X18=\"\",\"\",U32_H!X18),\"\")))))))))","v":""},"Les outillages, matériels de contrôle, de mesure, moyens de manutention."]
[{"$f":"IF($AV$7=\"\",\"\",IF($AV$7=\"A\",IF(U32_A!A19=\"\",\"\",U32_A!A19),IF($AV$7=\"B\",IF(U32_B!A19=\"\",\"\",U32_B!A19),IF($AV$7=\"C\",IF(U32_C!A19=\"\",\"\",U32_C!A19),IF($AV$7=\"D\",IF(U32_D!A19=\"\",\"\",U32_D!A19),IF($AV$7=\"E\",IF(U32_E!A19=\"\",\"\",U32_E!A19),IF($AV$7=\"F\",IF(U32_F!A19=\"\",\"\",U32_F!A19),IF($AV$7=\"G\",IF(U32_G!A19=\"\",\"\",U32_G!A19),IF($AV$7=\"H\",IF(U32_H!A19=\"\",\"\",U32_H!A19),\"\")))))))))","v":""},"Le carnet de prescription de sécurité électrique",null,null,null,null,null,null,null,null,null,null,null,null,null,null,null,null,null,null,null,null,null,{"$f":"IF($AV$7=\"\",\"\",IF($AV$7=\"A\",IF(U32_A!X19=\"\",\"\",U32_A!X19),IF($AV$7=\"B\",IF(U32_B!X19=\"\",\"\",U32_B!X19),IF($AV$7=\"C\",IF(U32_C!X19=\"\",\"\",U32_C!X19),IF($AV$7=\"D\",IF(U32_D!X19=\"\",\"\",U32_D!X19),IF($AV$7=\"E\",IF(U32_E!X19=\"\",\"\",U32_E!X19),IF($AV$7=\"F\",IF(U32_F!X19=\"\",\"\",U32_F!X19),IF($AV$7=\"G\",IF(U32_G!X19=\"\",\"\",U32_G!X19),IF($AV$7=\"H\",IF(U32_H!X19=\"\",\"\",U32_H!X19),\"\")))))))))","v":""},"Toutes documentations techniques"]
[{"$f":"IF($AV$7=\"\",\"\",IF($AV$7=\"A\",IF(U32_A!A20=\"\",\"\",U32_A!A20),IF($AV$7=\"B\",IF(U32_B!A20=\"\",\"\",U32_B!A20),IF($AV$7=\"C\",IF(U32_C!A20=\"\",\"\",U32_C!A20),IF($AV$7=\"D\",IF(U32_D!A20=\"\",\"\",U32_D!A20),IF($AV$7=\"E\",IF(U32_E!A20=\"\",\"\",U32_E!A20),IF($AV$7=\"F\",IF(U32_F!A20=\"\",\"\",U32_F!A20),IF($AV$7=\"G\",IF(U32_G!A20=\"\",\"\",U32_G!A20),IF($AV$7=\"H\",IF(U32_H!A20=\"\",\"\",U32_H!A20),\"\")))))))))","v":""},"Les normes",null,null,null,null,null,null,null,null,null,null,null,null,null,null,null,null,null,null,null,null,null,{"$f":"IF($AV$7=\"\",\"\",IF($AV$7=\"A\",IF(U32_A!X20=\"\",\"\",U32_A!X20),IF($AV$7=\"B\",IF(U32_B!X20=\"\",\"\",U32_B!X20),IF($AV$7=\"C\",IF(U32_C!X20=\"\",\"\",U32_C!X20),IF($AV$7=\"D\",IF(U32_D!X20=\"\",\"\",U32_D!X20),IF($AV$7=\"E\",IF(U32_E!X20=\"\",\"\",U32_E!X20),IF($AV$7=\"F\",IF(U32_F!X20=\"\",\"\",U32_F!X20),IF($AV$7=\"G\",IF(U32_G!X20=\"\",\"\",U32_G!X20),IF($AV$7=\"H\",IF(U32_H!X20=\"\",\"\",U32_H!X20),\"\")))))))))","v":""},"Les consignes et/ou procédures écrites"]
[{"$f":"IF($AV$7=\"\",\"\",IF($AV$7=\"A\",IF(U32_A!A21=\"\",\"\",U32_A!A21),IF($AV$7=\"B\",IF(U32_B!A21=\"\",\"\",U32_B!A21),IF($AV$7=\"C\",IF(U32_C!A21=\"\",\"\",U32_C!A21),IF($AV$7=\"D\",IF(U32_D!A21=\"\",\"\",U32_D!A21),IF($AV$7=\"E\",IF(U32_E!A21=\"\",\"\",U32_E!A21),IF($AV$7=\"F\",IF(U32_F!A21=\"\",\"\",U32_F!A21),IF($AV$7=\"G\",IF(U32_G!A21=\"\",\"\",U32_G!A21),IF($AV$7=\"H\",IF(U32_H!A21=\"\",\"\",U32_H!A21),\"\")))))))))","v":""},"Le plan d’implantation du bien",null,null,null,null,null,null,null,null,null,null,null,null,null,null,null,null,null,null,null,null,null,{"$f":"IF($AV$7=\"\",\"\",IF($AV$7=\"A\",IF(U32_A!X21=\"\",\"\",U32_A!X21),IF($AV$7=\"B\",IF(U32_B!X21=\"\",\"\",U32_B!X21),IF($AV$7=\"C\",IF(U32_C!X21=\"\",\"\",U32_C!X21),IF($AV$7=\"D\",IF(U32_D!X21=\"\",\"\",U32_D!X21),IF($AV$7=\"E\",IF(U32_E!X21=\"\",\"\",U32_E!X21),IF($AV$7=\"F\",IF(U32_F!X21=\"\",\"\",U32_F!X21),IF($AV$7=\"G\",IF(U32_G!X21=\"\",\"\",U32_G!X21),IF($AV$7=\"H\",IF(U32_H!X21=\"\",\"\",U32_H!X21),\"\")))))))))","v":""},"Le plan de prévention"]
[{"$f":"IF($AV$7=\"\",\"\",IF($AV$7=\"A\",IF(U32_A!A22=\"\",\"\",U32_A!A22),IF($AV$7=\"B\",IF(U32_B!A22=\"\",\"\",U32_B!A22),IF($AV$7=\"C\",IF(U32_C!A22=\"\",\"\",U32_C!A22),IF($AV$7=\"D\",IF(U32_D!A22=\"\",\"\",U32_D!A22),IF($AV$7=\"E\",IF(U32_E!A22=\"\",\"\",U32_E!A22),IF($AV$7=\"F\",IF(U32_F!A22=\"\",\"\",U32_F!A22),IF($AV$7=\"G\",IF(U32_G!A22=\"\",\"\",U32_G!A22),IF($AV$7=\"H\",IF(U32_H!A22=\"\",\"\",U32_H!A22),\"\")))))))))","v":""},null,null,null,null,null,null,null,null,null,null,null,null,null,null,null,null,null,null,null,null,null,null,{"$f":"IF($AV$7=\"\",\"\",IF($AV$7=\"A\",IF(U32_A!X22=\"\",\"\",U32_A!X22),IF($AV$7=\"B\",IF(U32_B!X22=\"\",\"\",U32_B!X22),IF($AV$7=\"C\",IF(U32_C!X22=\"\",\"\",U32_C!X22),IF($AV$7=\"D\",IF(U32_D!X22=\"\",\"\",U32_D!X22),IF($AV$7=\"E\",IF(U32_E!X22=\"\",\"\",U32_E!X22),IF($AV$7=\"F\",IF(U32_F!X22=\"\",\"\",U32_F!X22),IF($AV$7=\"G\",IF(U32_G!X22=\"\",\"\",U32_G!X22),IF($AV$7=\"H\",IF(U32_H!X22=\"\",\"\",U32_H!X22),\"\")))))))))","v":""}]
[{"$f":"IF($AV$7=\"\",\"\",IF($AV$7=\"A\",IF(U32_A!A23=\"\",\"\",U32_A!A23),IF($AV$7=\"B\",IF(U32_B!A23=\"\",\"\",U32_B!A23),IF($AV$7=\"C\",IF(U32_C!A23=\"\",\"\",U32_C!A23),IF($AV$7=\"D\",IF(U32_D!A23=\"\",\"\",U32_D!A23),IF($AV$7=\"E\",IF(U32_E!A23=\"\",\"\",U32_E!A23),IF($AV$7=\"F\",IF(U32_F!A23=\"\",\"\",U32_F!A23),IF($AV$7=\"G\",IF(U32_G!A23=\"\",\"\",U32_G!A23),IF($AV$7=\"H\",IF(U32_H!A23=\"\",\"\",U32_H!A23),\"\")))))))))","v":""},null,null,null,null,null,null,null,null,null,null,null,null,null,null,null,null,null,null,null,null,null,null,{"$f":"IF($AV$7=\"\",\"\",IF($AV$7=\"A\",IF(U32_A!X23=\"\",\"\",U32_A!X23),IF($AV$7=\"B\",IF(U32_B!X23=\"\",\"\",U32_B!X23),IF($AV$7=\"C\",IF(U32_C!X23=\"\",\"\",U32_C!X23),IF($AV$7=\"D\",IF(U32_D!X23=\"\",\"\",U32_D!X23),IF($AV$7=\"E\",IF(U32_E!X23=\"\",\"\",U32_E!X23),IF($AV$7=\"F\",IF(U32_F!X23=\"\",\"\",U32_F!X23),IF($AV$7=\"G\",IF(U32_G!X23=\"\",\"\",U32_G!X23),IF($AV$7=\"H\",IF(U32_H!X23=\"\",\"\",U32_H!X23),\"\")))))))))","v":""}]
["     ÇRepérer les données fournies",null,null,null,null,null,null,null,null,null,null,null,null,null,null,null,null,null,null,null,null,null,null,null,"ÇRepérer les données fournies"]
["Travail demandé"]
[{"$f":"IF($AV$7=\"\",\"\",IF($AV$7=\"A\",IF(U32_A!A26=\"\",\"\",U32_A!A26),IF($AV$7=\"B\",IF(U32_B!A26=\"\",\"\",U32_B!A26),IF($AV$7=\"C\",IF(U32_C!A26=\"\",\"\",U32_C!A26),IF($AV$7=\"D\",IF(U32_D!A26=\"\",\"\",U32_D!A26),IF($AV$7=\"E\",IF(U32_E!A26=\"\",\"\",U32_E!A26),IF($AV$7=\"F\",IF(U32_F!A26=\"\",\"\",U32_F!A26),IF($AV$7=\"G\",IF(U32_G!A26=\"\",\"\",U32_G!A26),IF($AV$7=\"H\",IF(U32_H!A26=\"\",\"\",U32_H!A26),\"\")))))))))","v":""},"A1-T3",null,"Réaliser la maintenance corrective - Réaliser des réparations, des dépannages dans les domaines : mécanique, électrique, pneumatique, hydraulique."]
[{"$f":"IF($AV$7=\"\",\"\",IF($AV$7=\"A\",IF(U32_A!A27=\"\",\"\",U32_A!A27),IF($AV$7=\"B\",IF(U32_B!A27=\"\",\"\",U32_B!A27),IF($AV$7=\"C\",IF(U32_C!A27=\"\",\"\",U32_C!A27),IF($AV$7=\"D\",IF(U32_D!A27=\"\",\"\",U32_D!A27),IF($AV$7=\"E\",IF(U32_E!A27=\"\",\"\",U32_E!A27),IF($AV$7=\"F\",IF(U32_F!A27=\"\",\"\",U32_F!A27),IF($AV$7=\"G\",IF(U32_G!A27=\"\",\"\",U32_G!A27),IF($AV$7=\"H\",IF(U32_H!A27=\"\",\"\",U32_H!A27),\"\")))))))))","v":""},"A2-T2",null,"Réaliser la maintenance préventive - Réaliser des opérations planifiées."]
["L’ENSEMBLE DES ACTIVITES ET DES TACHES SONT MOBILISEES EN CE QUI CONCERNE LA COMPETENCE CP1.7 QUI A TRAIT A LA SECURITE ET A LA PREVENTION DES RISQUES"]
["Consulter le référentiel des activités professionnelles pour obtenir le détail des tâches."]
["Ç Repérer les tâches demandées (ce sont celles qui correspondent à l’unité dans le référentiel de certification, à l’exclusion de toute autre)"]
["Appréciation globale et proposition de note : "]
[]
["Noms et signatures des évaluateurs :\n\n\n",null,null,null,null,null,null,null,null,null,null,null,null,null,null,null,null,null,null,null,null,null,null,null,null,null,null,null,null,null,null,null,null,null,null,"Note proposée :          ",null,null,null,null,{"$f":"IF(AI79=\"\",\"\",AI79)","v":""},null,null,"/20"]
[null,null,null,null,null,null,null,null,null,null,null,null,null,null,null,null,null,null,null,null,null,null,null,null,null,null,null,null,null,null,null,null,null,null,null,"Note affectée de son coefficient :",null,null,null,null,{"$f":"IF(AO33=\"\",\"\",AO33*3)","v":""},null,null,"/60"]
["Baccalauréat professionnel « maintenance des équipements industriels »  – Unité U 32",null,null,null,null,null,null,null,null,null,null,null,null,null,null,null,null,null,null,null,null,null,null,null,null,null,null,null,null,null,null,null,null,null,"Validé",null,null,null,"-       Synthèse    +"]
[]
["CP 1.3 - Réparer un composant",null,null,null,null,null,null,null,null,null,null,null,null,null,null,null,null,null,null,null,null,null,null,null,null,null,null,null,null,null,"Evalué",null,null,null,{"$f":"IF(AE37=\"Non Evalué\",\"NE\",IF(AE37=\"Evalué\",\"E\",\"\"))","v":"E"},{"$f":"COUNTIF(AI39:AL56,\"Validé\")","v":0},{"$f":"COUNTIF(AI39:AL56,\"Non Validé\")","v":0},{"$f":"COUNTIF(AI39:AL56,\"Non Evalué\")","v":0},null,null,null,null,null,null,null,null,null,{"$f":"IF(AE37=\"\",\"Souhaitez-vous évaluer la compétence ?\",IF(AND(AE37=\"Non Evalué\",OR(AJ37<>0,AK37<>0)),\"Vous avez choisi de ne pas évaluer la compétence. Ne rien indiquez dans la colonne Validé.\",IF(AND(AE37=\"Evalué\",OR(AI39=\"\",AI41=\"\",AI43=\"\",AI45=\"\",AI47=\"\",AI49=\"\",AI51=\"\",AI53=\"\",AI55=\"\")),\"Vous avez choisi d'évaluer la compétence. Indiquez pour chaques actions : Validé, Non Validé ou Non Evalué.\",IF(OR(AE37=\"Non Evalué\",(AJ37+AK37)=0),\"\",CONCATENATE(ROUND((100*AJ38/(AJ38+AK38)),0),\" % d'actions validées. \",AJ37,\" validée(s) sur \",AJ37+AK37,\" . Conseil: Au maximum , grisez \",ROUND((100*AJ38/(AJ38+AK38))*8/100,0),\" colonnes\")))))","v":"Vous avez choisi d'évaluer la compétence. Indiquez pour chaques actions : Validé, Non Validé ou Non Evalué."}]
[null,null,null,null,null,null,null,null,null,null,null,null,null,null,null,null,null,null,null,null,null,null,null,null,null,null,null,null,null,null,null,null,null,null,null,{"$f":"SUMPRODUCT((AI39:AL56=\"Validé\")*(Bareme!AE249:AE266))","v":0},{"$f":"SUMPRODUCT((AI39:AL56=\"Non Validé\")*(Bareme!AE249:AE266))","v":0}]
[1,null,"Etudier le démontage, analyser la gamme ou la réaliser si nécessaire.",null,null,null,null,null,null,null,null,null,null,"La stratégie est logique et permet un démontage sans détérioration.",null,null,null,null,null,null,null,null,null,null,null,null,null,null,null,null,null,null,null,null,null,null,null,null,null,null,null,null,null,null,null,null,null,0]
[]
[2,null,"Rassembler et vérifier les outillages et matériels nécessaires.",null,null,null,null,null,null,null,null,null,null,"Les moyens rassemblés sont en bon état et adaptés à l’intervention."]
[]
[3,null,"Effectuer le démontage",null,null,null,null,null,null,null,null,null,null,"Les moyens de manutention et l’outillage sont mis en œuvre correctement et en toute sécurité"]
[]
[4,null,"Analyser l’état du composant.",null,null,null,null,null,null,null,null,null,null,"L’inspection du composant permet :\n- de définir les pièces à remplacer ou à retoucher."]
[]
[null,null,null,null,null,null,null,null,null,null,null,null,null,"L’inspection du composant permet :\n- d’évaluer le coût de la réparation et de décider de sa poursuite."]
[]
[5,null,"Vérifier la disponibilité des pièces de rechange, des consommables, et leurs correspondances avec le composant démonté.",null,null,null,null,null,null,null,null,null,null,"Les pièces de rechanges commandées ou sorties du magasin sont conformes."]
[]
[6,null,"Remonter le composant avec les pièces de rechange, le régler.",null,null,null,null,null,null,null,null,null,null,"Le remontage est réalisé dans le respect des procédures."]
[null,null,null,null,null,null,null,null,null,null,null,null,null,null,null,null,null,null,null,null,null,null,null,null,null,null,null,null,null,null,null,null,null,null,null,null,null,null,"Commentaires:\n"]
[null,null,null,null,null,null,null,null,null,null,null,null,null,"Les réglages et essais nécessaires sont correctement réalisés."]
[]
[7,null,"Vérifier le bon fonctionnement du composant.",null,null,null,null,null,null,null,null,null,null,"La réparation réalisée est conforme aux exigences de fonctionnement du composant"]
[]
["CP 1.7 - Identifier les risques, définir et mettre en œuvre les mesures de prévention adaptées : \névaluations des risques autres qu’électriques\n",null,null,null,null,null,null,null,null,null,null,null,null,null,null,null,null,null,null,null,null,null,null,null,null,null,null,null,null,null,"Evalué",null,null,null,{"$f":"IF(AE57=\"Non Evalué\",\"NE\",IF(AE57=\"Evalué\",\"E\",\"\"))","v":"E"},{"$f":"COUNTIF(AI59:AL74,\"Validé\")","v":0},{"$f":"COUNTIF(AI59:AL74,\"Non Validé\")","v":0},{"$f":"COUNTIF(AI59:AL74,\"Non Evalué\")","v":0},null,null,null,null,null,null,null,null,null,{"$f":"IF(AE57=\"\",\"Souhaitez-vous évaluer la compétence ?\",IF(AND(AE57=\"Non Evalué\",OR(AJ57<>0,AK57<>0)),\"Vous avez choisi de ne pas évaluer la compétence. Ne rien indiquez dans la colonne Validé.\",IF(AND(AE57=\"Evalué\",OR(AI59=\"\",AI61=\"\",AI63=\"\",AI65=\"\",AI67=\"\",AI69=\"\",AI71=\"\",AI73=\"\")),\"Vous avez choisi d'évaluer la compétence. Indiquez pour chaques actions : Validé, Non Validé ou Non Evalué.\",IF(OR(AE57=\"Non Evalué\",(AJ57+AK57)=0),\"\",CONCATENATE(ROUND((100*AJ58/(AJ58+AK58)),0),\" % d'actions validées. \",AJ57,\" validée(s) sur \",AJ57+AK57,\" . Conseil: Au maximum , grisez \",ROUND((100*AJ58/(AJ58+AK58))*8/100,0),\" colonnes\")))))","v":"Vous avez choisi d'évaluer la compétence. Indiquez pour chaques actions : Validé, Non Validé ou Non Evalué."}]
[null,null,null,null,null,null,null,null,null,null,null,null,null,null,null,null,null,null,null,null,null,null,null,null,null,null,null,null,null,null,null,null,null,null,null,{"$f":"SUMPRODUCT((AI59:AL74=\"Validé\")*(Bareme!AE269:AE284))","v":0},{"$f":"SUMPRODUCT((AI59:AL74=\"Non Validé\")*(Bareme!AE269:AE284))","v":0}]
[1,null,"Identifier les phénomènes dangereux et les situations dangereuses",null,null,null,null,null,null,null,null,null,null,"Les phénomènes dangereux et les situations dangereuses liés au bien, à son environnement et à l’activité sont identifiés.",null,null,null,null,null,null,null,null,null,null,null,null,null,null,null,null,null,null,null,null,null,null,null,null,null,null,null,null,null,null,null,null,null,0]
[]
[2,null,"Déterminer les mesures de prévention en regard des situations dangereuses identifiées dans l’acte de maintenance",null,null,null,null,null,null,null,null,null,null,"Les mesures de prévention définies sont adaptées aux situations dangereuses identifiées",null,null,null,null,null,null,null,null,null,null,null,null,null,null,null,null,null,null,null,null,null,null,null,null,"Commentaires:\n"]
[]
[3,null,"Mettre en œuvre les E.P.I.",null,null,null,null,null,null,null,null,null,null,"La mise en œuvre des E.P.I. est correcte."]
[]
[4,null,"Mettre en œuvre les E.P.C.",null,null,null,null,null,null,null,null,null,null,"La mise en œuvre des E.P.C. est correcte."]
[]
[5,null,"Utiliser des équipements individuels de sécurité (EIS)",null,null,null,null,null,null,null,null,null,null,"La mise en œuvre des E.I.S. est correcte."]
[]
[6,null,"Consigner (energie,accés…)\nRespecter les procédures",null,null,null,null,null,null,null,null,null,null,"Les procédures de mise en œuvre des équipements et des outillages sont conformes"]
[]
[7,null,"Proposer des modifications au plan de prévention.",null,null,null,null,null,null,null,null,null,null,"Les propositions permettent:\n- de se prémunir de situations ou de phénomènes dangereux résiduels identifiés."]
[]
[null,null,null,null,null,null,null,null,null,null,null,null,null,"Les propositions permettent:\n- d’améliorer les mesures de prévention préconisées."]
[]
[]
[null,null,null,null,{"$f":"IF(OR(I88=\"\",(AND(AE37=\"\",AE57=\"\"))=0),\"\",CONCATENATE(\"PROPOSITION: \",CEILING(I88,0.5),\"/20 (\",ROUND(100*COUNTIF(U87:U88,\"E\")/(COUNTIF(U87:U88,\"E\")+COUNTIF(U87:U88,\"NE\")),0),\"% des compétences évaluées).\"))","v":"PROPOSITION: 0/20 (100% des compétences évaluées)."}]
[]
[]
[null,null,null,null,"Proposition des évaluateurs:"]
[]
[]
[]
[]
[null,null,"Ne pas effacer"]
[null,null,null,null,null,null,null,null,null,null,null,null,null,null,{"$f":"CONCATENATE(\"Statistique U32 de \",$AE$4)","v":{"$error":"#N/A"}}]
[null,null,null,null,null,null,null,null,null,null,null,null,null,null,"Compétences",{"$f":"IF(AE4=\"\",\"\",AE4)","v":{"$error":"#N/A"}},"Satisfaction maximale","Satisfaction moyenne",{"$f":"CONCATENATE(\"Statistique U31 de \",$AE$4)","v":{"$error":"#N/A"}},"Coefficients","Validée ou Non Validée"]
[null,null,"Somme",null,null,null,null,null,{"$f":"SUMPRODUCT((P87:P88))","v":0},null,{"$f":"SUM(Q87:Q88)","v":800},null,null,null,{"$f":"A37","v":"CP 1.3 - Réparer un composant"},{"$f":"IF(OR(U87=\"NE\",U87=\"\"),\"\",S87*T87)","v":0},{"$f":"IF(OR(U87=\"NE\",U87=\"\"),\"\",T87*8)","v":640},{"$f":"IF(OR(U87=\"NE\",U87=\"\"),\"\",Q87/2)","v":320},{"$f":"IF($AV$39=\"\",\"\",$AV$39)","v":0},{"$f":"Bareme!AE247","v":80},{"$f":"IF(AI37=\"\",\"\",AI37)","v":"E"}]
[null,null,"Moyenne /20",null,null,null,null,null,{"$f":"IF($K$87=0,\"\",K88*$I$87/$K$87)","v":0},null,20,null,null,null,{"$f":"A57","v":"CP 1.7 - Identifier les risques, définir et mettre en œuvre les mesures de prévention adaptées : \névaluations des risques autres qu’électriques\n"},0,160,80,{"$f":"IF($AV$59=\"\",\"\",$AV$59)","v":0},{"$f":"Bareme!AE267","v":20},{"$f":"IF(AI57=\"\",\"\",AI57)","v":"E"}]
[null,null,null,null,null,null,null,null,null,null,null,null,null,null,null,"","",""]
[null,null,"Moyenne /40",null,null,null,null,null,{"$f":"IF($K$87=0,\"\",K90*$I$87/$K$87)","v":0},null,60]
[]
[null,null,"Ne pas effacer"]

{"sheet":"U33","index":8,"n_rows":182,"n_cols":48,"rows_kept":182,"cut":false,"hidden":true,"merged":[[19,1,19,22],[19,24,19,45],[20,1,20,22],[20,24,20,45],[21,1,21,22],[5,47,5,48],[6,47,7,48],[18,1,18,22],[18,24,18,45],[12,0,12,45],[13,1,13,22],[13,24,13,45],[14,1,14,22],[14,24,14,45],[15,1,15,22],[15,24,15,45],[6,0,6,45],[7,0,7,45],[8,0,8,45],[9,0,9,45],[10,0,10,45],[16,1,16,22],[16,24,16,45],[17,1,17,22],[17,24,17,45],[0,0,0,45],[1,0,1,45],[2,0,2,22],[2,23,2,29],[2,30,2,45],[3,0,5,22],[3,23,3,29],[3,30,4,45],[4,23,4,29],[5,23,5,29],[5,30,5,45],[21,24,21,45],[29,1,29,2],[30,1,30,2],[25,1,25,22],[25,24,25,45],[27,0,27,45],[28,1,28,2],[22,1,22,22],[22,24,22,45],[23,1,23,22],[23,24,23,45],[24,1,24,22],[24,24,24,45],[28,3,28,45],[29,3,29,45],[30,3,30,45],[46,13,47,33],[46,34,47,37],[31,1,31,2],[32,1,32,2],[33,0,33,45],[34,0,34,45],[36,0,36,45],[37,0,37,45],[38,0,39,34],[38,35,38,39],[38,40,38,42],[38,43,38,45],[39,35,39,39],[39,40,39,42],[39,43,39,45],[31,3,31,45],[32,3,32,45],[42,47,43,49],[44,13,45,33],[44,34,45,37],[40,0,41,33],[40,34,41,37],[40,38,40,45],[41,38,41,45],[42,0,43,29],[42,30,43,33],[76,34,77,37],[84,13,85,33],[84,34,85,37],[82,13,83,33],[82,34,83,37],[74,0,75,29],[74,30,75,33],[74,47,75,49],[48,13,49,33],[48,34,49,37],[50,13,51,33],[50,34,51,37],[72,13,73,33],[72,34,73,37],[60,13,61,33],[60,34,61,37],[52,13,53,33],[52,34,53,37],[68,13,69,33],[68,34,69,37],[76,0,77,1],[76,2,77,12],[56,13,57,33],[54,13,55,33],[90,34,91,37],[88,13,89,33],[88,34,89,37],[94,0,97,1],[94,2,97,12],[98,0,99,1],[98,2,99,12],[78,13,79,33],[78,34,79,37],[80,13,81,33],[80,34,81,37],[86,13,87,33],[86,34,87,37],[78,0,79,1],[78,2,79,12],[80,0,81,1],[80,2,81,12],[82,0,85,1],[82,2,85,12],[86,0,87,1],[86,2,87,12],[88,0,89,1],[88,2,89,12],[90,0,91,33],[102,34,103,37],[104,13,105,33],[104,34,105,37],[179,3,180,8],[179,9,180,10],[179,11,180,12],[177,3,178,8],[177,9,178,10],[177,11,178,12],[165,4,167,39],[168,4,170,33],[168,34,170,39],[175,3,176,8],[175,9,176,10],[175,11,176,12],[173,15,173,21],[106,13,107,33],[106,34,107,37],[108,13,109,33],[108,34,109,37],[110,13,111,33],[102,2,103,12],[104,2,105,12],[106,2,107,12],[92,47,93,49],[94,13,95,33],[94,34,95,37],[96,13,97,33],[96,34,97,37],[98,13,99,33],[98,34,99,37],[100,13,101,33],[100,34,101,37],[92,0,93,29],[92,30,93,33],[100,0,101,1],[100,2,101,12],[120,34,121,37],[122,0,123,29],[122,30,123,33],[122,47,123,49],[110,34,111,37],[112,13,113,33],[112,34,113,37],[114,13,115,33],[114,34,115,37],[116,13,117,33],[116,34,117,37],[118,13,119,33],[118,34,119,37],[118,0,119,1],[118,2,119,12],[120,0,121,1],[120,2,121,12],[120,13,121,33],[110,0,111,1],[110,2,111,12],[112,0,117,1],[112,2,117,12],[136,13,137,33],[136,34,137,37],[138,13,139,33],[138,34,139,37],[124,13,125,33],[124,34,125,37],[126,13,127,33],[126,34,127,37],[128,13,129,33],[128,34,129,37],[130,13,131,33],[130,34,131,37],[132,13,133,33],[132,34,133,37],[134,13,135,33],[134,34,135,37],[136,2,139,12],[136,0,139,1],[124,0,125,1],[124,2,125,12],[126,0,127,1],[126,2,127,12],[128,0,129,1],[128,2,129,12],[130,0,131,1],[130,2,131,12],[132,0,133,1],[132,2,133,12],[134,0,135,1],[134,2,135,12],[102,13,103,33],[102,0,103,1],[104,0,105,1],[106,0,107,1],[108,0,109,1],[108,2,109,12],[64,2,67,12],[68,0,73,1],[68,2,73,12],[70,13,71,33],[76,13,77,33],[90,38,90,45],[91,38,91,45],[128,38,139,45],[101,38,121,45],[83,38,89,45],[60,38,73,45],[54,34,55,37],[44,2,49,12],[44,0,49,1],[50,0,51,1],[50,2,51,12],[52,0,63,1],[52,2,63,12],[56,34,57,37],[58,13,59,33],[58,34,59,37],[62,13,63,33],[62,34,63,37],[70,34,71,37],[64,13,65,33],[64,34,65,37],[66,13,67,33],[66,34,67,37],[64,0,67,1]]}
["Baccalauréat professionnel « maintenance des équipements industriels » "]
["Épreuve E33 (Unité U33) : Maintenance d’un système automatisé"]
["Établissement : (tampon)",null,null,null,null,null,null,null,null,null,null,null,null,null,null,null,null,null,null,null,null,null,null,"Session : ",null,null,null,null,null,null,{"$f":"IF(Bilan!B2=\"\",\"\",Bilan!B2)","v":""}]
[{"$f":"IF(Bilan!B3=\"\",\"\",Bilan!B3)","v":""},null,null,null,null,null,null,null,null,null,null,null,null,null,null,null,null,null,null,null,null,null,null,"Nom du candidat:",null,null,null,null,null,null,{"$f":"IF(INDEX((Bilan!B5:B34),(MATCH(RIGHT(CELL(\"nomfichier\",A1),LEN(CELL(\"nomfichier\",A1))-FIND(\"]\",CELL(\"nomfichier\",A1))),Bilan!J5:J34,0)))=\"\",\"\",INDEX((Bilan!B5:B34),(MATCH(RIGHT(CELL(\"nomfichier\",A1),LEN(CELL(\"nomfichier\",A1))-FIND(\"]\",CELL(\"nomfichier\",A1))),Bilan!J5:J34,0))))","v":{"$error":"#N/A"}}]
[null,null,null,null,null,null,null,null,null,null,null,null,null,null,null,null,null,null,null,null,null,null,null,"Prénom : "]
[null,null,null,null,null,null,null,null,null,null,null,null,null,null,null,null,null,null,null,null,null,null,null,"Date de l'évaluation:",null,null,null,null,null,null,null,null,null,null,null,null,null,null,null,null,null,null,null,null,null,null,null,"Choisisser votre situation"]
["Lieu d’évaluation :"]
["      Etablissement"]
["      Entreprise :       "]
["Description sommaire du travail demandé :"]
[{"$f":"IF($AV$7=\"\",\"\",IF($AV$7=\"A\",IF(U33_A!A11=\"\",\"\",U33_A!A11),IF($AV$7=\"B\",IF(U33_B!A11=\"\",\"\",U33_B!A11),IF($AV$7=\"C\",IF(U33_C!A11=\"\",\"\",U33_C!A11),IF($AV$7=\"D\",IF(U33_D!A11=\"\",\"\",U33_D!A11),IF($AV$7=\"E\",IF(U33_E!A11=\"\",\"\",U33_E!A11),IF($AV$7=\"F\",IF(U33_F!A11=\"\",\"\",U33_F!A11),IF($AV$7=\"G\",IF(U33_G!A11=\"\",\"\",U33_G!A11),IF($AV$7=\"H\",IF(U33_H!A11=\"\",\"\",U33_H!A11),\"\")))))))))","v":""},{"$f":"IF($AV$7=\"\",\"\",IF($AV$7=\"A\",IF(U33_A!B11=\"\",\"\",U33_A!B11),IF($AV$7=\"B\",IF(U33_B!B11=\"\",\"\",U33_B!B11),IF($AV$7=\"C\",IF(U33_C!B11=\"\",\"\",U33_C!B11),IF($AV$7=\"D\",IF(U33_D!B11=\"\",\"\",U33_D!B11),IF($AV$7=\"E\",IF(U33_E!B11=\"\",\"\",U33_E!B11),IF($AV$7=\"F\",IF(U33_F!B11=\"\",\"\",U33_F!B11),IF($AV$7=\"G\",IF(U33_G!B11=\"\",\"\",U33_G!B11),IF($AV$7=\"H\",IF(U33_H!B11=\"\",\"\",U33_H!B11),\"\")))))))))","v":""},{"$f":"IF($AV$7=\"\",\"\",IF($AV$7=\"A\",IF(U33_A!C11=\"\",\"\",U33_A!C11),IF($AV$7=\"B\",IF(U33_B!C11=\"\",\"\",U33_B!C11),IF($AV$7=\"C\",IF(U33_C!C11=\"\",\"\",U33_C!C11),IF($AV$7=\"D\",IF(U33_D!C11=\"\",\"\",U33_D!C11),IF($AV$7=\"E\",IF(U33_E!C11=\"\",\"\",U33_E!C11),IF($AV$7=\"F\",IF(U33_F!C11=\"\",\"\",U33_F!C11),IF($AV$7=\"G\",IF(U33_G!C11=\"\",\"\",U33_G!C11),IF($AV$7=\"H\",IF(U33_H!C11=\"\",\"\",U33_H!C11),\"\")))))))))","v":""},{"$f":"IF($AV$7=\"\",\"\",IF($AV$7=\"A\",IF(U33_A!D11=\"\",\"\",U33_A!D11),IF($AV$7=\"B\",IF(U33_B!D11=\"\",\"\",U33_B!D11),IF($AV$7=\"C\",IF(U33_C!D11=\"\",\"\",U33_C!D11),IF($AV$7=\"D\",IF(U33_D!D11=\"\",\"\",U33_D!D11),IF($AV$7=\"E\",IF(U33_E!D11=\"\",\"\",U33_E!D11),IF($AV$7=\"F\",IF(U33_F!D11=\"\",\"\",U33_F!D11),IF($AV$7=\"G\",IF(U33_G!D11=\"\",\"\",U33_G!D11),IF($AV$7=\"H\",IF(U33_H!D11=\"\",\"\",U33_H!D11),\"\")))))))))","v":""},{"$f":"IF($AV$7=\"\",\"\",IF($AV$7=\"A\",IF(U33_A!E11=\"\",\"\",U33_A!E11),IF($AV$7=\"B\",IF(U33_B!E11=\"\",\"\",U33_B!E11),IF($AV$7=\"C\",IF(U33_C!E11=\"\",\"\",U33_C!E11),IF($AV$7=\"D\",IF(U33_D!E11=\"\",\"\",U33_D!E11),IF($AV$7=\"E\",IF(U33_E!E11=\"\",\"\",U33_E!E11),IF($AV$7=\"F\",IF(U33_F!E11=\"\",\"\",U33_F!E11),IF($AV$7=\"G\",IF(U33_G!E11=\"\",\"\",U33_G!E11),IF($AV$7=\"H\",IF(U33_H!E11=\"\",\"\",U33_H!E11),\"\")))))))))","v":""},{"$f":"IF($AV$7=\"\",\"\",IF($AV$7=\"A\",IF(U33_A!F11=\"\",\"\",U33_A!F11),IF($AV$7=\"B\",IF(U33_B!F11=\"\",\"\",U33_B!F11),IF($AV$7=\"C\",IF(U33_C!F11=\"\",\"\",U33_C!F11),IF($AV$7=\"D\",IF(U33_D!F11=\"\",\"\",U33_D!F11),IF($AV$7=\"E\",IF(U33_E!F11=\"\",\"\",U33_E!F11),IF($AV$7=\"F\",IF(U33_F!F11=\"\",\"\",U33_F!F11),IF($AV$7=\"G\",IF(U33_G!F11=\"\",\"\",U33_G!F11),IF($AV$7=\"H\",IF(U33_H!F11=\"\",\"\",U33_H!F11),\"\")))))))))","v":""},{"$f":"IF($AV$7=\"\",\"\",IF($AV$7=\"A\",IF(U33_A!G11=\"\",\"\",U33_A!G11),IF($AV$7=\"B\",IF(U33_B!G11=\"\",\"\",U33_B!G11),IF($AV$7=\"C\",IF(U33_C!G11=\"\",\"\",U33_C!G11),IF($AV$7=\"D\",IF(U33_D!G11=\"\",\"\",U33_D!G11),IF($AV$7=\"E\",IF(U33_E!G11=\"\",\"\",U33_E!G11),IF($AV$7=\"F\",IF(U33_F!G11=\"\",\"\",U33_F!G11),IF($AV$7=\"G\",IF(U33_G!G11=\"\",\"\",U33_G!G11),IF($AV$7=\"H\",IF(U33_H!G11=\"\",\"\",U33_H!G11),\"\")))))))))","v":""},{"$f":"IF($AV$7=\"\",\"\",IF($AV$7=\"A\",IF(U33_A!H11=\"\",\"\",U33_A!H11),IF($AV$7=\"B\",IF(U33_B!H11=\"\",\"\",U33_B!H11),IF($AV$7=\"C\",IF(U33_C!H11=\"\",\"\",U33_C!H11),IF($AV$7=\"D\",IF(U33_D!H11=\"\",\"\",U33_D!H11),IF($AV$7=\"E\",IF(U33_E!H11=\"\",\"\",U33_E!H11),IF($AV$7=\"F\",IF(U33_F!H11=\"\",\"\",U33_F!H11),IF($AV$7=\"G\",IF(U33_G!H11=\"\",\"\",U33_G!H11),IF($AV$7=\"H\",IF(U33_H!H11=\"\",\"\",U33_H!H11),\"\")))))))))","v":""},{"$f":"IF($AV$7=\"\",\"\",IF($AV$7=\"A\",IF(U33_A!I11=\"\",\"\",U33_A!I11),IF($AV$7=\"B\",IF(U33_B!I11=\"\",\"\",U33_B!I11),IF($AV$7=\"C\",IF(U33_C!I11=\"\",\"\",U33_C!I11),IF($AV$7=\"D\",IF(U33_D!I11=\"\",\"\",U33_D!I11),IF($AV$7=\"E\",IF(U33_E!I11=\"\",\"\",U33_E!I11),IF($AV$7=\"F\",IF(U33_F!I11=\"\",\"\",U33_F!I11),IF($AV$7=\"G\",IF(U33_G!I11=\"\",\"\",U33_G!I11),IF($AV$7=\"H\",IF(U33_H!I11=\"\",\"\",U33_H!I11),\"\")))))))))","v":""},{"$f":"IF($AV$7=\"\",\"\",IF($AV$7=\"A\",IF(U33_A!J11=\"\",\"\",U33_A!J11),IF($AV$7=\"B\",IF(U33_B!J11=\"\",\"\",U33_B!J11),IF($AV$7=\"C\",IF(U33_C!J11=\"\",\"\",U33_C!J11),IF($AV$7=\"D\",IF(U33_D!J11=\"\",\"\",U33_D!J11),IF($AV$7=\"E\",IF(U33_E!J11=\"\",\"\",U33_E!J11),IF($AV$7=\"F\",IF(U33_F!J11=\"\",\"\",U33_F!J11),IF($AV$7=\"G\",IF(U33_G!J11=\"\",\"\",U33_G!J11),IF($AV$7=\"H\",IF(U33_H!J11=\"\",\"\",U33_H!J11),\"\")))))))))","v":""},{"$f":"IF($AV$7=\"\",\"\",IF($AV$7=\"A\",IF(U33_A!K11=\"\",\"\",U33_A!K11),IF($AV$7=\"B\",IF(U33_B!K11=\"\",\"\",U33_B!K11),IF($AV$7=\"C\",IF(U33_C!K11=\"\",\"\",U33_C!K11),IF($AV$7=\"D\",IF(U33_D!K11=\"\",\"\",U33_D!K11),IF($AV$7=\"E\",IF(U33_E!K11=\"\",\"\",U33_E!K11),IF($AV$7=\"F\",IF(U33_F!K11=\"\",\"\",U33_F!K11),IF($AV$7=\"G\",IF(U33_G!K11=\"\",\"\",U33_G!K11),IF($AV$7=\"H\",IF(U33_H!K11=\"\",\"\",U33_H!K11),\"\")))))))))","v":""},{"$f":"IF($AV$7=\"\",\"\",IF($AV$7=\"A\",IF(U33_A!L11=\"\",\"\",U33_A!L11),IF($AV$7=\"B\",IF(U33_B!L11=\"\",\"\",U33_B!L11),IF($AV$7=\"C\",IF(U33_C!L11=\"\",\"\",U33_C!L11),IF($AV$7=\"D\",IF(U33_D!L11=\"\",\"\",U33_D!L11),IF($AV$7=\"E\",IF(U33_E!L11=\"\",\"\",U33_E!L11),IF($AV$7=\"F\",IF(U33_F!L11=\"\",\"\",U33_F!L11),IF($AV$7=\"G\",IF(U33_G!L11=\"\",\"\",U33_G!L11),IF($AV$7=\"H\",IF(U33_H!L11=\"\",\"\",U33_H!L11),\"\")))))))))","v":""},{"$f":"IF($AV$7=\"\",\"\",IF($AV$7=\"A\",IF(U33_A!M11=\"\",\"\",U33_A!M11),IF($AV$7=\"B\",IF(U33_B!M11=\"\",\"\",U33_B!M11),IF($AV$7=\"C\",IF(U33_C!M11=\"\",\"\",U33_C!M11),IF($AV$7=\"D\",IF(U33_D!M11=\"\",\"\",U33_D!M11),IF($AV$7=\"E\",IF(U33_E!M11=\"\",\"\",U33_E!M11),IF($AV$7=\"F\",IF(U33_F!M11=\"\",\"\",U33_F!M11),IF($AV$7=\"G\",IF(U33_G!M11=\"\",\"\",U33_G!M11),IF($AV$7=\"H\",IF(U33_H!M11=\"\",\"\",U33_H!M11),\"\")))))))))","v":""},{"$f":"IF($AV$7=\"\",\"\",IF($AV$7=\"A\",IF(U33_A!N11=\"\",\"\",U33_A!N11),IF($AV$7=\"B\",IF(U33_B!N11=\"\",\"\",U33_B!N11),IF($AV$7=\"C\",IF(U33_C!N11=\"\",\"\",U33_C!N11),IF($AV$7=\"D\",IF(U33_D!N11=\"\",\"\",U33_D!N11),IF($AV$7=\"E\",IF(U33_E!N11=\"\",\"\",U33_E!N11),IF($AV$7=\"F\",IF(U33_F!N11=\"\",\"\",U33_F!N11),IF($AV$7=\"G\",IF(U33_G!N11=\"\",\"\",U33_G!N11),IF($AV$7=\"H\",IF(U33_H!N11=\"\",\"\",U33_H!N11),\"\")))))))))","v":""},{"$f":"IF($AV$7=\"\",\"\",IF($AV$7=\"A\",IF(U33_A!O11=\"\",\"\",U33_A!O11),IF($AV$7=\"B\",IF(U33_B!O11=\"\",\"\",U33_B!O11),IF($AV$7=\"C\",IF(U33_C!O11=\"\",\"\",U33_C!O11),IF($AV$7=\"D\",IF(U33_D!O11=\"\",\"\",U33_D!O11),IF($AV$7=\"E\",IF(U33_E!O11=\"\",\"\",U33_E!O11),IF($AV$7=\"F\",IF(U33_F!O11=\"\",\"\",U33_F!O11),IF($AV$7=\"G\",IF(U33_G!O11=\"\",\"\",U33_G!O11),IF($AV$7=\"H\",IF(U33_H!O11=\"\",\"\",U33_H!O11),\"\")))))))))","v":""},{"$f":"IF($AV$7=\"\",\"\",IF($AV$7=\"A\",IF(U33_A!P11=\"\",\"\",U33_A!P11),IF($AV$7=\"B\",IF(U33_B!P11=\"\",\"\",U33_B!P11),IF($AV$7=\"C\",IF(U33_C!P11=\"\",\"\",U33_C!P11),IF($AV$7=\"D\",IF(U33_D!P11=\"\",\"\",U33_D!P11),IF($AV$7=\"E\",IF(U33_E!P11=\"\",\"\",U33_E!P11),IF($AV$7=\"F\",IF(U33_F!P11=\"\",\"\",U33_F!P11),IF($AV$7=\"G\",IF(U33_G!P11=\"\",\"\",U33_G!P11),IF($AV$7=\"H\",IF(U33_H!P11=\"\",\"\",U33_H!P11),\"\")))))))))","v":""},{"$f":"IF($AV$7=\"\",\"\",IF($AV$7=\"A\",IF(U33_A!Q11=\"\",\"\",U33_A!Q11),IF($AV$7=\"B\",IF(U33_B!Q11=\"\",\"\",U33_B!Q11),IF($AV$7=\"C\",IF(U33_C!Q11=\"\",\"\",U33_C!Q11),IF($AV$7=\"D\",IF(U33_D!Q11=\"\",\"\",U33_D!Q11),IF($AV$7=\"E\",IF(U33_E!Q11=\"\",\"\",U33_E!Q11),IF($AV$7=\"F\",IF(U33_F!Q11=\"\",\"\",U33_F!Q11),IF($AV$7=\"G\",IF(U33_G!Q11=\"\",\"\",U33_G!Q11),IF($AV$7=\"H\",IF(U33_H!Q11=\"\",\"\",U33_H!Q11),\"\")))))))))","v":""},{"$f":"IF($AV$7=\"\",\"\",IF($AV$7=\"A\",IF(U33_A!R11=\"\",\"\",U33_A!R11),IF($AV$7=\"B\",IF(U33_B!R11=\"\",\"\",U33_B!R11),IF($AV$7=\"C\",IF(U33_C!R11=\"\",\"\",U33_C!R11),IF($AV$7=\"D\",IF(U33_D!R11=\"\",\"\",U33_D!R11),IF($AV$7=\"E\",IF(U33_E!R11=\"\",\"\",U33_E!R11),IF($AV$7=\"F\",IF(U33_F!R11=\"\",\"\",U33_F!R11),IF($AV$7=\"G\",IF(U33_G!R11=\"\",\"\",U33_G!R11),IF($AV$7=\"H\",IF(U33_H!R11=\"\",\"\",U33_H!R11),\"\")))))))))","v":""},{"$f":"IF($AV$7=\"\",\"\",IF($AV$7=\"A\",IF(U33_A!S11=\"\",\"\",U33_A!S11),IF($AV$7=\"B\",IF(U33_B!S11=\"\",\"\",U33_B!S11),IF($AV$7=\"C\",IF(U33_C!S11=\"\",\"\",U33_C!S11),IF($AV$7=\"D\",IF(U33_D!S11=\"\",\"\",U33_D!S11),IF($AV$7=\"E\",IF(U33_E!S11=\"\",\"\",U33_E!S11),IF($AV$7=\"F\",IF(U33_F!S11=\"\",\"\",U33_F!S11),IF($AV$7=\"G\",IF(U33_G!S11=\"\",\"\",U33_G!S11),IF($AV$7=\"H\",IF(U33_H!S11=\"\",\"\",U33_H!S11),\"\")))))))))","v":""},{"$f":"IF($AV$7=\"\",\"\",IF($AV$7=\"A\",IF(U33_A!T11=\"\",\"\",U33_A!T11),IF($AV$7=\"B\",IF(U33_B!T11=\"\",\"\",U33_B!T11),IF($AV$7=\"C\",IF(U33_C!T11=\"\",\"\",U33_C!T11),IF($AV$7=\"D\",IF(U33_D!T11=\"\",\"\",U33_D!T11),IF($AV$7=\"E\",IF(U33_E!T11=\"\",\"\",U33_E!T11),IF($AV$7=\"F\",IF(U33_F!T11=\"\",\"\",U33_F!T11),IF($AV$7=\"G\",IF(U33_G!T11=\"\",\"\",U33_G!T11),IF($AV$7=\"H\",IF(U33_H!T11=\"\",\"\",U33_H!T11),\"\")))))))))","v":""},{"$f":"IF($AV$7=\"\",\"\",IF($AV$7=\"A\",IF(U33_A!U11=\"\",\"\",U33_A!U11),IF($AV$7=\"B\",IF(U33_B!U11=\"\",\"\",U33_B!U11),IF($AV$7=\"C\",IF(U33_C!U11=\"\",\"\",U33_C!U11),IF($AV$7=\"D\",IF(U33_D!U11=\"\",\"\",U33_D!U11),IF($AV$7=\"E\",IF(U33_E!U11=\"\",\"\",U33_E!U11),IF($AV$7=\"F\",IF(U33_F!U11=\"\",\"\",U33_F!U11),IF($AV$7=\"G\",IF(U33_G!U11=\"\",\"\",U33_G!U11),IF($AV$7=\"H\",IF(U33_H!U11=\"\",\"\",U33_H!U11),\"\")))))))))","v":""},{"$f":"IF($AV$7=\"\",\"\",IF($AV$7=\"A\",IF(U33_A!V11=\"\",\"\",U33_A!V11),IF($AV$7=\"B\",IF(U33_B!V11=\"\",\"\",U33_B!V11),IF($AV$7=\"C\",IF(U33_C!V11=\"\",\"\",U33_C!V11),IF($AV$7=\"D\",IF(U33_D!V11=\"\",\"\",U33_D!V11),IF($AV$7=\"E\",IF(U33_E!V11=\"\",\"\",U33_E!V11),IF($AV$7=\"F\",IF(U33_F!V11=\"\",\"\",U33_F!V11),IF($AV$7=\"G\",IF(U33_G!V11=\"\",\"\",U33_G!V11),IF($AV$7=\"H\",IF(U33_H!V11=\"\",\"\",U33_H!V11),\"\")))))))))","v":""},{"$f":"IF($AV$7=\"\",\"\",IF($AV$7=\"A\",IF(U33_A!W11=\"\",\"\",U33_A!W11),IF($AV$7=\"B\",IF(U33_B!W11=\"\",\"\",U33_B!W11),IF($AV$7=\"C\",IF(U33_C!W11=\"\",\"\",U33_C!W11),IF($AV$7=\"D\",IF(U33_D!W11=\"\",\"\",U33_D!W11),IF($AV$7=\"E\",IF(U33_E!W11=\"\",\"\",U33_E!W11),IF($AV$7=\"F\",IF(U33_F!W11=\"\",\"\",U33_F!W11),IF($AV$7=\"G\",IF(U33_G!W11=\"\",\"\",U33_G!W11),IF($AV$7=\"H\",IF(U33_H!W11=\"\",\"\",U33_H!W11),\"\")))))))))","v":""},{"$f":"IF($AV$7=\"\",\"\",IF($AV$7=\"A\",IF(U33_A!X11=\"\",\"\",U33_A!X11),IF($AV$7=\"B\",IF(U33_B!X11=\"\",\"\",U33_B!X11),IF($AV$7=\"C\",IF(U33_C!X11=\"\",\"\",U33_C!X11),IF($AV$7=\"D\",IF(U33_D!X11=\"\",\"\",U33_D!X11),IF($AV$7=\"E\",IF(U33_E!X11=\"\",\"\",U33_E!X11),IF($AV$7=\"F\",IF(U33_F!X11=\"\",\"\",U33_F!X11),IF($AV$7=\"G\",IF(U33_G!X11=\"\",\"\",U33_G!X11),IF($AV$7=\"H\",IF(U33_H!X11=\"\",\"\",U33_H!X11),\"\")))))))))","v":""},{"$f":"IF($AV$7=\"\",\"\",IF($AV$7=\"A\",IF(U33_A!Y11=\"\",\"\",U33_A!Y11),IF($AV$7=\"B\",IF(U33_B!Y11=\"\",\"\",U33_B!Y11),IF($AV$7=\"C\",IF(U33_C!Y11=\"\",\"\",U33_C!Y11),IF($AV$7=\"D\",IF(U33_D!Y11=\"\",\"\",U33_D!Y11),IF($AV$7=\"E\",IF(U33_E!Y11=\"\",\"\",U33_E!Y11),IF($AV$7=\"F\",IF(U33_F!Y11=\"\",\"\",U33_F!Y11),IF($AV$7=\"G\",IF(U33_G!Y11=\"\",\"\",U33_G!Y11),IF($AV$7=\"H\",IF(U33_H!Y11=\"\",\"\",U33_H!Y11),\"\")))))))))","v":""},{"$f":"IF($AV$7=\"\",\"\",IF($AV$7=\"A\",IF(U33_A!Z11=\"\",\"\",U33_A!Z11),IF($AV$7=\"B\",IF(U33_B!Z11=\"\",\"\",U33_B!Z11),IF($AV$7=\"C\",IF(U33_C!Z11=\"\",\"\",U33_C!Z11),IF($AV$7=\"D\",IF(U33_D!Z11=\"\",\"\",U33_D!Z11),IF($AV$7=\"E\",IF(U33_E!Z11=\"\",\"\",U33_E!Z11),IF($AV$7=\"F\",IF(U33_F!Z11=\"\",\"\",U33_F!Z11),IF($AV$7=\"G\",IF(U33_G!Z11=\"\",\"\",U33_G!Z11),IF($AV$7=\"H\",IF(U33_H!Z11=\"\",\"\",U33_H!Z11),\"\")))))))))","v":""},{"$f":"IF($AV$7=\"\",\"\",IF($AV$7=\"A\",IF(U33_A!AA11=\"\",\"\",U33_A!AA11),IF($AV$7=\"B\",IF(U33_B!AA11=\"\",\"\",U33_B!AA11),IF($AV$7=\"C\",IF(U33_C!AA11=\"\",\"\",U33_C!AA11),IF($AV$7=\"D\",IF(U33_D!AA11=\"\",\"\",U33_D!AA11),IF($AV$7=\"E\",IF(U33_E!AA11=\"\",\"\",U33_E!AA11),IF($AV$7=\"F\",IF(U33_F!AA11=\"\",\"\",U33_F!AA11),IF($AV$7=\"G\",IF(U33_G!AA11=\"\",\"\",U33_G!AA11),IF($AV$7=\"H\",IF(U33_H!AA11=\"\",\"\",U33_H!AA11),\"\")))))))))","v":""},{"$f":"IF($AV$7=\"\",\"\",IF($AV$7=\"A\",IF(U33_A!AB11=\"\",\"\",U33_A!AB11),IF($AV$7=\"B\",IF(U33_B!AB11=\"\",\"\",U33_B!AB11),IF($AV$7=\"C\",IF(U33_C!AB11=\"\",\"\",U33_C!AB11),IF($AV$7=\"D\",IF(U33_D!AB11=\"\",\"\",U33_D!AB11),IF($AV$7=\"E\",IF(U33_E!AB11=\"\",\"\",U33_E!AB11),IF($AV$7=\"F\",IF(U33_F!AB11=\"\",\"\",U33_F!AB11),IF($AV$7=\"G\",IF(U33_G!AB11=\"\",\"\",U33_G!AB11),IF($AV$7=\"H\",IF(U33_H!AB11=\"\",\"\",U33_H!AB11),\"\")))))))))","v":""},{"$f":"IF($AV$7=\"\",\"\",IF($AV$7=\"A\",IF(U33_A!AC11=\"\",\"\",U33_A!AC11),IF($AV$7=\"B\",IF(U33_B!AC11=\"\",\"\",U33_B!AC11),IF($AV$7=\"C\",IF(U33_C!AC11=\"\",\"\",U33_C!AC11),IF($AV$7=\"D\",IF(U33_D!AC11=\"\",\"\",U33_D!AC11),IF($AV$7=\"E\",IF(U33_E!AC11=\"\",\"\",U33_E!AC11),IF($AV$7=\"F\",IF(U33_F!AC11=\"\",\"\",U33_F!AC11),IF($AV$7=\"G\",IF(U33_G!AC11=\"\",\"\",U33_G!AC11),IF($AV$7=\"H\",IF(U33_H!AC11=\"\",\"\",U33_H!AC11),\"\")))))))))","v":""},{"$f":"IF($AV$7=\"\",\"\",IF($AV$7=\"A\",IF(U33_A!AD11=\"\",\"\",U33_A!AD11),IF($AV$7=\"B\",IF(U33_B!AD11=\"\",\"\",U33_B!AD11),IF($AV$7=\"C\",IF(U33_C!AD11=\"\",\"\",U33_C!AD11),IF($AV$7=\"D\",IF(U33_D!AD11=\"\",\"\",U33_D!AD11),IF($AV$7=\"E\",IF(U33_E!AD11=\"\",\"\",U33_E!AD11),IF($AV$7=\"F\",IF(U33_F!AD11=\"\",\"\",U33_F!AD11),IF($AV$7=\"G\",IF(U33_G!AD11=\"\",\"\",U33_G!AD11),IF($AV$7=\"H\",IF(U33_H!AD11=\"\",\"\",U33_H!AD11),\"\")))))))))","v":""},{"$f":"IF($AV$7=\"\",\"\",IF($AV$7=\"A\",IF(U33_A!AE11=\"\",\"\",U33_A!AE11),IF($AV$7=\"B\",IF(U33_B!AE11=\"\",\"\",U33_B!AE11),IF($AV$7=\"C\",IF(U33_C!AE11=\"\",\"\",U33_C!AE11),IF($AV$7=\"D\",IF(U33_D!AE11=\"\",\"\",U33_D!AE11),IF($AV$7=\"E\",IF(U33_E!AE11=\"\",\"\",U33_E!AE11),IF($AV$7=\"F\",IF(U33_F!AE11=\"\",\"\",U33_F!AE11),IF($AV$7=\"G\",IF(U33_G!AE11=\"\",\"\",U33_G!AE11),IF($AV$7=\"H\",IF(U33_H!AE11=\"\",\"\",U33_H!AE11),\"\")))))))))","v":""},{"$f":"IF($AV$7=\"\",\"\",IF($AV$7=\"A\",IF(U33_A!AF11=\"\",\"\",U33_A!AF11),IF($AV$7=\"B\",IF(U33_B!AF11=\"\",\"\",U33_B!AF11),IF($AV$7=\"C\",IF(U33_C!AF11=\"\",\"\",U33_C!AF11),IF($AV$7=\"D\",IF(U33_D!AF11=\"\",\"\",U33_D!AF11),IF($AV$7=\"E\",IF(U33_E!AF11=\"\",\"\",U33_E!AF11),IF($AV$7=\"F\",IF(U33_F!AF11=\"\",\"\",U33_F!AF11),IF($AV$7=\"G\",IF(U33_G!AF11=\"\",\"\",U33_G!AF11),IF($AV$7=\"H\",IF(U33_H!AF11=\"\",\"\",U33_H!AF11),\"\")))))))))","v":""},{"$f":"IF($AV$7=\"\",\"\",IF($AV$7=\"A\",IF(U33_A!AG11=\"\",\"\",U33_A!AG11),IF($AV$7=\"B\",IF(U33_B!AG11=\"\",\"\",U33_B!AG11),IF($AV$7=\"C\",IF(U33_C!AG11=\"\",\"\",U33_C!AG11),IF($AV$7=\"D\",IF(U33_D!AG11=\"\",\"\",U33_D!AG11),IF($AV$7=\"E\",IF(U33_E!AG11=\"\",\"\",U33_E!AG11),IF($AV$7=\"F\",IF(U33_F!AG11=\"\",\"\",U33_F!AG11),IF($AV$7=\"G\",IF(U33_G!AG11=\"\",\"\",U33_G!AG11),IF($AV$7=\"H\",IF(U33_H!AG11=\"\",\"\",U33_H!AG11),\"\")))))))))","v":""},{"$f":"IF($AV$7=\"\",\"\",IF($AV$7=\"A\",IF(U33_A!AH11=\"\",\"\",U33_A!AH11),IF($AV$7=\"B\",IF(U33_B!AH11=\"\",\"\",U33_B!AH11),IF($AV$7=\"C\",IF(U33_C!AH11=\"\",\"\",U33_C!AH11),IF($AV$7=\"D\",IF(U33_D!AH11=\"\",\"\",U33_D!AH11),IF($AV$7=\"E\",IF(U33_E!AH11=\"\",\"\",U33_E!AH11),IF($AV$7=\"F\",IF(U33_F!AH11=\"\",\"\",U33_F!AH11),IF($AV$7=\"G\",IF(U33_G!AH11=\"\",\"\",U33_G!AH11),IF($AV$7=\"H\",IF(U33_H!AH11=\"\",\"\",U33_H!AH11),\"\")))))))))","v":""},{"$f":"IF($AV$7=\"\",\"\",IF($AV$7=\"A\",IF(U33_A!AI11=\"\",\"\",U33_A!AI11),IF($AV$7=\"B\",IF(U33_B!AI11=\"\",\"\",U33_B!AI11),IF($AV$7=\"C\",IF(U33_C!AI11=\"\",\"\",U33_C!AI11),IF($AV$7=\"D\",IF(U33_D!AI11=\"\",\"\",U33_D!AI11),IF($AV$7=\"E\",IF(U33_E!AI11=\"\",\"\",U33_E!AI11),IF($AV$7=\"F\",IF(U33_F!AI11=\"\",\"\",U33_F!AI11),IF($AV$7=\"G\",IF(U33_G!AI11=\"\",\"\",U33_G!AI11),IF($AV$7=\"H\",IF(U33_H!AI11=\"\",\"\",U33_H!AI11),\"\")))))))))","v":""},{"$f":"IF($AV$7=\"\",\"\",IF($AV$7=\"A\",IF(U33_A!AJ11=\"\",\"\",U33_A!AJ11),IF($AV$7=\"B\",IF(U33_B!AJ11=\"\",\"\",U33_B!AJ11),IF($AV$7=\"C\",IF(U33_C!AJ11=\"\",\"\",U33_C!AJ11),IF($AV$7=\"D\",IF(U33_D!AJ11=\"\",\"\",U33_D!AJ11),IF($AV$7=\"E\",IF(U33_E!AJ11=\"\",\"\",U33_E!AJ11),IF($AV$7=\"F\",IF(U33_F!AJ11=\"\",\"\",U33_F!AJ11),IF($AV$7=\"G\",IF(U33_G!AJ11=\"\",\"\",U33_G!AJ11),IF($AV$7=\"H\",IF(U33_H!AJ11=\"\",\"\",U33_H!AJ11),\"\")))))))))","v":""},{"$f":"IF($AV$7=\"\",\"\",IF($AV$7=\"A\",IF(U33_A!AK11=\"\",\"\",U33_A!AK11),IF($AV$7=\"B\",IF(U33_B!AK11=\"\",\"\",U33_B!AK11),IF($AV$7=\"C\",IF(U33_C!AK11=\"\",\"\",U33_C!AK11),IF($AV$7=\"D\",IF(U33_D!AK11=\"\",\"\",U33_D!AK11),IF($AV$7=\"E\",IF(U33_E!AK11=\"\",\"\",U33_E!AK11),IF($AV$7=\"F\",IF(U33_F!AK11=\"\",\"\",U33_F!AK11),IF($AV$7=\"G\",IF(U33_G!AK11=\"\",\"\",U33_G!AK11),IF($AV$7=\"H\",IF(U33_H!AK11=\"\",\"\",U33_H!AK11),\"\")))))))))","v":""},{"$f":"IF($AV$7=\"\",\"\",IF($AV$7=\"A\",IF(U33_A!AL11=\"\",\"\",U33_A!AL11),IF($AV$7=\"B\",IF(U33_B!AL11=\"\",\"\",U33_B!AL11),IF($AV$7=\"C\",IF(U33_C!AL11=\"\",\"\",U33_C!AL11),IF($AV$7=\"D\",IF(U33_D!AL11=\"\",\"\",U33_D!AL11),IF($AV$7=\"E\",IF(U33_E!AL11=\"\",\"\",U33_E!AL11),IF($AV$7=\"F\",IF(U33_F!AL11=\"\",\"\",U33_F!AL11),IF($AV$7=\"G\",IF(U33_G!AL11=\"\",\"\",U33_G!AL11),IF($AV$7=\"H\",IF(U33_H!AL11=\"\",\"\",U33_H!AL11),\"\")))))))))","v":""},{"$f":"IF($AV$7=\"\",\"\",IF($AV$7=\"A\",IF(U33_A!AM11=\"\",\"\",U33_A!AM11),IF($AV$7=\"B\",IF(U33_B!AM11=\"\",\"\",U33_B!AM11),IF($AV$7=\"C\",IF(U33_C!AM11=\"\",\"\",U33_C!AM11),IF($AV$7=\"D\",IF(U33_D!AM11=\"\",\"\",U33_D!AM11),IF($AV$7=\"E\",IF(U33_E!AM11=\"\",\"\",U33_E!AM11),IF($AV$7=\"F\",IF(U33_F!AM11=\"\",\"\",U33_F!AM11),IF($AV$7=\"G\",IF(U33_G!AM11=\"\",\"\",U33_G!AM11),IF($AV$7=\"H\",IF(U33_H!AM11=\"\",\"\",U33_H!AM11),\"\")))))))))","v":""},{"$f":"IF($AV$7=\"\",\"\",IF($AV$7=\"A\",IF(U33_A!AN11=\"\",\"\",U33_A!AN11),IF($AV$7=\"B\",IF(U33_B!AN11=\"\",\"\",U33_B!AN11),IF($AV$7=\"C\",IF(U33_C!AN11=\"\",\"\",U33_C!AN11),IF($AV$7=\"D\",IF(U33_D!AN11=\"\",\"\",U33_D!AN11),IF($AV$7=\"E\",IF(U33_E!AN11=\"\",\"\",U33_E!AN11),IF($AV$7=\"F\",IF(U33_F!AN11=\"\",\"\",U33_F!AN11),IF($AV$7=\"G\",IF(U33_G!AN11=\"\",\"\",U33_G!AN11),IF($AV$7=\"H\",IF(U33_H!AN11=\"\",\"\",U33_H!AN11),\"\")))))))))","v":""},{"$f":"IF($AV$7=\"\",\"\",IF($AV$7=\"A\",IF(U33_A!AO11=\"\",\"\",U33_A!AO11),IF($AV$7=\"B\",IF(U33_B!AO11=\"\",\"\",U33_B!AO11),IF($AV$7=\"C\",IF(U33_C!AO11=\"\",\"\",U33_C!AO11),IF($AV$7=\"D\",IF(U33_D!AO11=\"\",\"\",U33_D!AO11),IF($AV$7=\"E\",IF(U33_E!AO11=\"\",\"\",U33_E!AO11),IF($AV$7=\"F\",IF(U33_F!AO11=\"\",\"\",U33_F!AO11),IF($AV$7=\"G\",IF(U33_G!AO11=\"\",\"\",U33_G!AO11),IF($AV$7=\"H\",IF(U33_H!AO11=\"\",\"\",U33_H!AO11),\"\")))))))))","v":""},{"$f":"IF($AV$7=\"\",\"\",IF($AV$7=\"A\",IF(U33_A!AP11=\"\",\"\",U33_A!AP11),IF($AV$7=\"B\",IF(U33_B!AP11=\"\",\"\",U33_B!AP11),IF($AV$7=\"C\",IF(U33_C!AP11=\"\",\"\",U33_C!AP11),IF($AV$7=\"D\",IF(U33_D!AP11=\"\",\"\",U33_D!AP11),IF($AV$7=\"E\",IF(U33_E!AP11=\"\",\"\",U33_E!AP11),IF($AV$7=\"F\",IF(U33_F!AP11=\"\",\"\",U33_F!AP11),IF($AV$7=\"G\",IF(U33_G!AP11=\"\",\"\",U33_G!AP11),IF($AV$7=\"H\",IF(U33_H!AP11=\"\",\"\",U33_H!AP11),\"\")))))))))","v":""},{"$f":"IF($AV$7=\"\",\"\",IF($AV$7=\"A\",IF(U33_A!AQ11=\"\",\"\",U33_A!AQ11),IF($AV$7=\"B\",IF(U33_B!AQ11=\"\",\"\",U33_B!AQ11),IF($AV$7=\"C\",IF(U33_C!AQ11=\"\",\"\",U33_C!AQ11),IF($AV$7=\"D\",IF(U33_D!AQ11=\"\",\"\",U33_D!AQ11),IF($AV$7=\"E\",IF(U33_E!AQ11=\"\",\"\",U33_E!AQ11),IF($AV$7=\"F\",IF(U33_F!AQ11=\"\",\"\",U33_F!AQ11),IF($AV$7=\"G\",IF(U33_G!AQ11=\"\",\"\",U33_G!AQ11),IF($AV$7=\"H\",IF(U33_H!AQ11=\"\",\"\",U33_H!AQ11),\"\")))))))))","v":""},{"$f":"IF($AV$7=\"\",\"\",IF($AV$7=\"A\",IF(U33_A!AR11=\"\",\"\",U33_A!AR11),IF($AV$7=\"B\",IF(U33_B!AR11=\"\",\"\",U33_B!AR11),IF($AV$7=\"C\",IF(U33_C!AR11=\"\",\"\",U33_C!AR11),IF($AV$7=\"D\",IF(U33_D!AR11=\"\",\"\",U33_D!AR11),IF($AV$7=\"E\",IF(U33_E!AR11=\"\",\"\",U33_E!AR11),IF($AV$7=\"F\",IF(U33_F!AR11=\"\",\"\",U33_F!AR11),IF($AV$7=\"G\",IF(U33_G!AR11=\"\",\"\",U33_G!AR11),IF($AV$7=\"H\",IF(U33_H!AR11=\"\",\"\",U33_H!AR11),\"\")))))))))","v":""},{"$f":"IF($AV$7=\"\",\"\",IF($AV$7=\"A\",IF(U33_A!AS11=\"\",\"\",U33_A!AS11),IF($AV$7=\"B\",IF(U33_B!AS11=\"\",\"\",U33_B!AS11),IF($AV$7=\"C\",IF(U33_C!AS11=\"\",\"\",U33_C!AS11),IF($AV$7=\"D\",IF(U33_D!AS11=\"\",\"\",U33_D!AS11),IF($AV$7=\"E\",IF(U33_E!AS11=\"\",\"\",U33_E!AS11),IF($AV$7=\"F\",IF(U33_F!AS11=\"\",\"\",U33_F!AS11),IF($AV$7=\"G\",IF(U33_G!AS11=\"\",\"\",U33_G!AS11),IF($AV$7=\"H\",IF(U33_H!AS11=\"\",\"\",U33_H!AS11),\"\")))))))))","v":""},{"$f":"IF($AV$7=\"\",\"\",IF($AV$7=\"A\",IF(U33_A!AT11=\"\",\"\",U33_A!AT11),IF($AV$7=\"B\",IF(U33_B!AT11=\"\",\"\",U33_B!AT11),IF($AV$7=\"C\",IF(U33_C!AT11=\"\",\"\",U33_C!AT11),IF($AV$7=\"D\",IF(U33_D!AT11=\"\",\"\",U33_D!AT11),IF($AV$7=\"E\",IF(U33_E!AT11=\"\",\"\",U33_E!AT11),IF($AV$7=\"F\",IF(U33_F!AT11=\"\",\"\",U33_F!AT11),IF($AV$7=\"G\",IF(U33_G!AT11=\"\",\"\",U33_G!AT11),IF($AV$7=\"H\",IF(U33_H!AT11=\"\",\"\",U33_H!AT11),\"\")))))))))","v":""}]
[]
["Données fournies au candidat"]
[{"$f":"IF($AV$7=\"\",\"\",IF($AV$7=\"A\",IF(U33_A!A14=\"\",\"\",U33_A!A14),IF($AV$7=\"B\",IF(U33_B!A14=\"\",\"\",U33_B!A14),IF($AV$7=\"C\",IF(U33_C!A14=\"\",\"\",U33_C!A14),IF($AV$7=\"D\",IF(U33_D!A14=\"\",\"\",U33_D!A14),IF($AV$7=\"E\",IF(U33_E!A14=\"\",\"\",U33_E!A14),IF($AV$7=\"F\",IF(U33_F!A14=\"\",\"\",U33_F!A14),IF($AV$7=\"G\",IF(U33_G!A14=\"\",\"\",U33_G!A14),IF($AV$7=\"H\",IF(U33_H!A14=\"\",\"\",U33_H!A14),\"\")))))))))","v":""},"Un bien en panne totale ou partielle.",null,null,null,null,null,null,null,null,null,null,null,null,null,null,null,null,null,null,null,null,null,{"$f":"IF($AV$7=\"\",\"\",IF($AV$7=\"A\",IF(U33_A!X14=\"\",\"\",U33_A!X14),IF($AV$7=\"B\",IF(U33_B!X14=\"\",\"\",U33_B!X14),IF($AV$7=\"C\",IF(U33_C!X14=\"\",\"\",U33_C!X14),IF($AV$7=\"D\",IF(U33_D!X14=\"\",\"\",U33_D!X14),IF($AV$7=\"E\",IF(U33_E!X14=\"\",\"\",U33_E!X14),IF($AV$7=\"F\",IF(U33_F!X14=\"\",\"\",U33_F!X14),IF($AV$7=\"G\",IF(U33_G!X14=\"\",\"\",U33_G!X14),IF($AV$7=\"H\",IF(U33_H!X14=\"\",\"\",U33_H!X14),\"\")))))))))","v":""},"Le bon de travail."]
[{"$f":"IF($AV$7=\"\",\"\",IF($AV$7=\"A\",IF(U33_A!A15=\"\",\"\",U33_A!A15),IF($AV$7=\"B\",IF(U33_B!A15=\"\",\"\",U33_B!A15),IF($AV$7=\"C\",IF(U33_C!A15=\"\",\"\",U33_C!A15),IF($AV$7=\"D\",IF(U33_D!A15=\"\",\"\",U33_D!A15),IF($AV$7=\"E\",IF(U33_E!A15=\"\",\"\",U33_E!A15),IF($AV$7=\"F\",IF(U33_F!A15=\"\",\"\",U33_F!A15),IF($AV$7=\"G\",IF(U33_G!A15=\"\",\"\",U33_G!A15),IF($AV$7=\"H\",IF(U33_H!A15=\"\",\"\",U33_H!A15),\"\")))))))))","v":""},"Le dossier technique du bien et son dossier de maintenance sur supports papiers ou supports numériques",null,null,null,null,null,null,null,null,null,null,null,null,null,null,null,null,null,null,null,null,null,{"$f":"IF($AV$7=\"\",\"\",IF($AV$7=\"A\",IF(U33_A!X15=\"\",\"\",U33_A!X15),IF($AV$7=\"B\",IF(U33_B!X15=\"\",\"\",U33_B!X15),IF($AV$7=\"C\",IF(U33_C!X15=\"\",\"\",U33_C!X15),IF($AV$7=\"D\",IF(U33_D!X15=\"\",\"\",U33_D!X15),IF($AV$7=\"E\",IF(U33_E!X15=\"\",\"\",U33_E!X15),IF($AV$7=\"F\",IF(U33_F!X15=\"\",\"\",U33_F!X15),IF($AV$7=\"G\",IF(U33_G!X15=\"\",\"\",U33_G!X15),IF($AV$7=\"H\",IF(U33_H!X15=\"\",\"\",U33_H!X15),\"\")))))))))","v":""},"Toutes informations en provenance de l’utilisateur ou d’autres intervenants"]
[{"$f":"IF($AV$7=\"\",\"\",IF($AV$7=\"A\",IF(U33_A!A16=\"\",\"\",U33_A!A16),IF($AV$7=\"B\",IF(U33_B!A16=\"\",\"\",U33_B!A16),IF($AV$7=\"C\",IF(U33_C!A16=\"\",\"\",U33_C!A16),IF($AV$7=\"D\",IF(U33_D!A16=\"\",\"\",U33_D!A16),IF($AV$7=\"E\",IF(U33_E!A16=\"\",\"\",U33_E!A16),IF($AV$7=\"F\",IF(U33_F!A16=\"\",\"\",U33_F!A16),IF($AV$7=\"G\",IF(U33_G!A16=\"\",\"\",U33_G!A16),IF($AV$7=\"H\",IF(U33_H!A16=\"\",\"\",U33_H!A16),\"\")))))))))","v":""},"Les Consignes et/ou les procédures écrites",null,null,null,null,null,null,null,null,null,null,null,null,null,null,null,null,null,null,null,null,null,{"$f":"IF($AV$7=\"\",\"\",IF($AV$7=\"A\",IF(U33_A!X16=\"\",\"\",U33_A!X16),IF($AV$7=\"B\",IF(U33_B!X16=\"\",\"\",U33_B!X16),IF($AV$7=\"C\",IF(U33_C!X16=\"\",\"\",U33_C!X16),IF($AV$7=\"D\",IF(U33_D!X16=\"\",\"\",U33_D!X16),IF($AV$7=\"E\",IF(U33_E!X16=\"\",\"\",U33_E!X16),IF($AV$7=\"F\",IF(U33_F!X16=\"\",\"\",U33_F!X16),IF($AV$7=\"G\",IF(U33_G!X16=\"\",\"\",U33_G!X16),IF($AV$7=\"H\",IF(U33_H!X16=\"\",\"\",U33_H!X16),\"\")))))))))","v":""},"La description des évènements par l’exploitant"]
[{"$f":"IF($AV$7=\"\",\"\",IF($AV$7=\"A\",IF(U33_A!A17=\"\",\"\",U33_A!A17),IF($AV$7=\"B\",IF(U33_B!A17=\"\",\"\",U33_B!A17),IF($AV$7=\"C\",IF(U33_C!A17=\"\",\"\",U33_C!A17),IF($AV$7=\"D\",IF(U33_D!A17=\"\",\"\",U33_D!A17),IF($AV$7=\"E\",IF(U33_E!A17=\"\",\"\",U33_E!A17),IF($AV$7=\"F\",IF(U33_F!A17=\"\",\"\",U33_F!A17),IF($AV$7=\"G\",IF(U33_G!A17=\"\",\"\",U33_G!A17),IF($AV$7=\"H\",IF(U33_H!A17=\"\",\"\",U33_H!A17),\"\")))))))))","v":""},"Le dossier historique du bien.",null,null,null,null,null,null,null,null,null,null,null,null,null,null,null,null,null,null,null,null,null,{"$f":"IF($AV$7=\"\",\"\",IF($AV$7=\"A\",IF(U33_A!X17=\"\",\"\",U33_A!X17),IF($AV$7=\"B\",IF(U33_B!X17=\"\",\"\",U33_B!X17),IF($AV$7=\"C\",IF(U33_C!X17=\"\",\"\",U33_C!X17),IF($AV$7=\"D\",IF(U33_D!X17=\"\",\"\",U33_D!X17),IF($AV$7=\"E\",IF(U33_E!X17=\"\",\"\",U33_E!X17),IF($AV$7=\"F\",IF(U33_F!X17=\"\",\"\",U33_F!X17),IF($AV$7=\"G\",IF(U33_G!X17=\"\",\"\",U33_G!X17),IF($AV$7=\"H\",IF(U33_H!X17=\"\",\"\",U33_H!X17),\"\")))))))))","v":""},"La documentation technique du bien."]
[{"$f":"IF($AV$7=\"\",\"\",IF($AV$7=\"A\",IF(U33_A!A18=\"\",\"\",U33_A!A18),IF($AV$7=\"B\",IF(U33_B!A18=\"\",\"\",U33_B!A18),IF($AV$7=\"C\",IF(U33_C!A18=\"\",\"\",U33_C!A18),IF($AV$7=\"D\",IF(U33_D!A18=\"\",\"\",U33_D!A18),IF($AV$7=\"E\",IF(U33_E!A18=\"\",\"\",U33_E!A18),IF($AV$7=\"F\",IF(U33_F!A18=\"\",\"\",U33_F!A18),IF($AV$7=\"G\",IF(U33_G!A18=\"\",\"\",U33_G!A18),IF($AV$7=\"H\",IF(U33_H!A18=\"\",\"\",U33_H!A18),\"\")))))))))","v":""},"Document unique d’évaluation des risques",null,null,null,null,null,null,null,null,null,null,null,null,null,null,null,null,null,null,null,null,null,{"$f":"IF($AV$7=\"\",\"\",IF($AV$7=\"A\",IF(U33_A!X18=\"\",\"\",U33_A!X18),IF($AV$7=\"B\",IF(U33_B!X18=\"\",\"\",U33_B!X18),IF($AV$7=\"C\",IF(U33_C!X18=\"\",\"\",U33_C!X18),IF($AV$7=\"D\",IF(U33_D!X18=\"\",\"\",U33_D!X18),IF($AV$7=\"E\",IF(U33_E!X18=\"\",\"\",U33_E!X18),IF($AV$7=\"F\",IF(U33_F!X18=\"\",\"\",U33_F!X18),IF($AV$7=\"G\",IF(U33_G!X18=\"\",\"\",U33_G!X18),IF($AV$7=\"H\",IF(U33_H!X18=\"\",\"\",U33_H!X18),\"\")))))))))","v":""},"Le plan de prévention"]
[{"$f":"IF($AV$7=\"\",\"\",IF($AV$7=\"A\",IF(U33_A!A19=\"\",\"\",U33_A!A19),IF($AV$7=\"B\",IF(U33_B!A19=\"\",\"\",U33_B!A19),IF($AV$7=\"C\",IF(U33_C!A19=\"\",\"\",U33_C!A19),IF($AV$7=\"D\",IF(U33_D!A19=\"\",\"\",U33_D!A19),IF($AV$7=\"E\",IF(U33_E!A19=\"\",\"\",U33_E!A19),IF($AV$7=\"F\",IF(U33_F!A19=\"\",\"\",U33_F!A19),IF($AV$7=\"G\",IF(U33_G!A19=\"\",\"\",U33_G!A19),IF($AV$7=\"H\",IF(U33_H!A19=\"\",\"\",U33_H!A19),\"\")))))))))","v":""}," Eventuellement une aide au diagnostic :\n- Tableau cause/effet\n- Organigramme de défaillance\n- Diagramme cause/effet – AMPEC, - AMDE…\n",null,null,null,null,null,null,null,null,null,null,null,null,null,null,null,null,null,null,null,null,null,{"$f":"IF($AV$7=\"\",\"\",IF($AV$7=\"A\",IF(U33_A!X19=\"\",\"\",U33_A!X19),IF($AV$7=\"B\",IF(U33_B!X19=\"\",\"\",U33_B!X19),IF($AV$7=\"C\",IF(U33_C!X19=\"\",\"\",U33_C!X19),IF($AV$7=\"D\",IF(U33_D!X19=\"\",\"\",U33_D!X19),IF($AV$7=\"E\",IF(U33_E!X19=\"\",\"\",U33_E!X19),IF($AV$7=\"F\",IF(U33_F!X19=\"\",\"\",U33_F!X19),IF($AV$7=\"G\",IF(U33_G!X19=\"\",\"\",U33_G!X19),IF($AV$7=\"H\",IF(U33_H!X19=\"\",\"\",U33_H!X19),\"\")))))))))","v":""},"Les moyens d’investigation :\nConsole de programmation maintenance.\nLes appareils de mesure, de contrôle, moyens de manutention.\n"]
[{"$f":"IF($AV$7=\"\",\"\",IF($AV$7=\"A\",IF(U33_A!A20=\"\",\"\",U33_A!A20),IF($AV$7=\"B\",IF(U33_B!A20=\"\",\"\",U33_B!A20),IF($AV$7=\"C\",IF(U33_C!A20=\"\",\"\",U33_C!A20),IF($AV$7=\"D\",IF(U33_D!A20=\"\",\"\",U33_D!A20),IF($AV$7=\"E\",IF(U33_E!A20=\"\",\"\",U33_E!A20),IF($AV$7=\"F\",IF(U33_F!A20=\"\",\"\",U33_F!A20),IF($AV$7=\"G\",IF(U33_G!A20=\"\",\"\",U33_G!A20),IF($AV$7=\"H\",IF(U33_H!A20=\"\",\"\",U33_H!A20),\"\")))))))))","v":""},"Les outillages nécessaires.",null,null,null,null,null,null,null,null,null,null,null,null,null,null,null,null,null,null,null,null,null,{"$f":"IF($AV$7=\"\",\"\",IF($AV$7=\"A\",IF(U33_A!X20=\"\",\"\",U33_A!X20),IF($AV$7=\"B\",IF(U33_B!X20=\"\",\"\",U33_B!X20),IF($AV$7=\"C\",IF(U33_C!X20=\"\",\"\",U33_C!X20),IF($AV$7=\"D\",IF(U33_D!X20=\"\",\"\",U33_D!X20),IF($AV$7=\"E\",IF(U33_E!X20=\"\",\"\",U33_E!X20),IF($AV$7=\"F\",IF(U33_F!X20=\"\",\"\",U33_F!X20),IF($AV$7=\"G\",IF(U33_G!X20=\"\",\"\",U33_G!X20),IF($AV$7=\"H\",IF(U33_H!X20=\"\",\"\",U33_H!X20),\"\")))))))))","v":""},"Les  documentations constructeur spécifiques"]
[{"$f":"IF($AV$7=\"\",\"\",IF($AV$7=\"A\",IF(U33_A!A21=\"\",\"\",U33_A!A21),IF($AV$7=\"B\",IF(U33_B!A21=\"\",\"\",U33_B!A21),IF($AV$7=\"C\",IF(U33_C!A21=\"\",\"\",U33_C!A21),IF($AV$7=\"D\",IF(U33_D!A21=\"\",\"\",U33_D!A21),IF($AV$7=\"E\",IF(U33_E!A21=\"\",\"\",U33_E!A21),IF($AV$7=\"F\",IF(U33_F!A21=\"\",\"\",U33_F!A21),IF($AV$7=\"G\",IF(U33_G!A21=\"\",\"\",U33_G!A21),IF($AV$7=\"H\",IF(U33_H!A21=\"\",\"\",U33_H!A21),\"\")))))))))","v":""},"Les pièces de rechange, consommables",null,null,null,null,null,null,null,null,null,null,null,null,null,null,null,null,null,null,null,null,null,{"$f":"IF($AV$7=\"\",\"\",IF($AV$7=\"A\",IF(U33_A!X21=\"\",\"\",U33_A!X21),IF($AV$7=\"B\",IF(U33_B!X21=\"\",\"\",U33_B!X21),IF($AV$7=\"C\",IF(U33_C!X21=\"\",\"\",U33_C!X21),IF($AV$7=\"D\",IF(U33_D!X21=\"\",\"\",U33_D!X21),IF($AV$7=\"E\",IF(U33_E!X21=\"\",\"\",U33_E!X21),IF($AV$7=\"F\",IF(U33_F!X21=\"\",\"\",U33_F!X21),IF($AV$7=\"G\",IF(U33_G!X21=\"\",\"\",U33_G!X21),IF($AV$7=\"H\",IF(U33_H!X21=\"\",\"\",U33_H!X21),\"\")))))))))","v":""},"Le plan d’implantation du bien"]
[{"$f":"IF($AV$7=\"\",\"\",IF($AV$7=\"A\",IF(U33_A!A22=\"\",\"\",U33_A!A22),IF($AV$7=\"B\",IF(U33_B!A22=\"\",\"\",U33_B!A22),IF($AV$7=\"C\",IF(U33_C!A22=\"\",\"\",U33_C!A22),IF($AV$7=\"D\",IF(U33_D!A22=\"\",\"\",U33_D!A22),IF($AV$7=\"E\",IF(U33_E!A22=\"\",\"\",U33_E!A22),IF($AV$7=\"F\",IF(U33_F!A22=\"\",\"\",U33_F!A22),IF($AV$7=\"G\",IF(U33_G!A22=\"\",\"\",U33_G!A22),IF($AV$7=\"H\",IF(U33_H!A22=\"\",\"\",U33_H!A22),\"\")))))))))","v":""},"Les équipements de protection individuels et collectifs",null,null,null,null,null,null,null,null,null,null,null,null,null,null,null,null,null,null,null,null,null,{"$f":"IF($AV$7=\"\",\"\",IF($AV$7=\"A\",IF(U33_A!X22=\"\",\"\",U33_A!X22),IF($AV$7=\"B\",IF(U33_B!X22=\"\",\"\",U33_B!X22),IF($AV$7=\"C\",IF(U33_C!X22=\"\",\"\",U33_C!X22),IF($AV$7=\"D\",IF(U33_D!X22=\"\",\"\",U33_D!X22),IF($AV$7=\"E\",IF(U33_E!X22=\"\",\"\",U33_E!X22),IF($AV$7=\"F\",IF(U33_F!X22=\"\",\"\",U33_F!X22),IF($AV$7=\"G\",IF(U33_G!X22=\"\",\"\",U33_G!X22),IF($AV$7=\"H\",IF(U33_H!X22=\"\",\"\",U33_H!X22),\"\")))))))))","v":""},"Les équipements individuels de sécurité"]
[{"$f":"IF($AV$7=\"\",\"\",IF($AV$7=\"A\",IF(U33_A!A23=\"\",\"\",U33_A!A23),IF($AV$7=\"B\",IF(U33_B!A23=\"\",\"\",U33_B!A23),IF($AV$7=\"C\",IF(U33_C!A23=\"\",\"\",U33_C!A23),IF($AV$7=\"D\",IF(U33_D!A23=\"\",\"\",U33_D!A23),IF($AV$7=\"E\",IF(U33_E!A23=\"\",\"\",U33_E!A23),IF($AV$7=\"F\",IF(U33_F!A23=\"\",\"\",U33_F!A23),IF($AV$7=\"G\",IF(U33_G!A23=\"\",\"\",U33_G!A23),IF($AV$7=\"H\",IF(U33_H!A23=\"\",\"\",U33_H!A23),\"\")))))))))","v":""},"Le planning des interventions",null,null,null,null,null,null,null,null,null,null,null,null,null,null,null,null,null,null,null,null,null,{"$f":"IF($AV$7=\"\",\"\",IF($AV$7=\"A\",IF(U33_A!X23=\"\",\"\",U33_A!X23),IF($AV$7=\"B\",IF(U33_B!X23=\"\",\"\",U33_B!X23),IF($AV$7=\"C\",IF(U33_C!X23=\"\",\"\",U33_C!X23),IF($AV$7=\"D\",IF(U33_D!X23=\"\",\"\",U33_D!X23),IF($AV$7=\"E\",IF(U33_E!X23=\"\",\"\",U33_E!X23),IF($AV$7=\"F\",IF(U33_F!X23=\"\",\"\",U33_F!X23),IF($AV$7=\"G\",IF(U33_G!X23=\"\",\"\",U33_G!X23),IF($AV$7=\"H\",IF(U33_H!X23=\"\",\"\",U33_H!X23),\"\")))))))))","v":""},"Les documents utilisateurs du ou des postes de travail."]
[{"$f":"IF($AV$7=\"\",\"\",IF($AV$7=\"A\",IF(U33_A!A24=\"\",\"\",U33_A!A24),IF($AV$7=\"B\",IF(U33_B!A24=\"\",\"\",U33_B!A24),IF($AV$7=\"C\",IF(U33_C!A24=\"\",\"\",U33_C!A24),IF($AV$7=\"D\",IF(U33_D!A24=\"\",\"\",U33_D!A24),IF($AV$7=\"E\",IF(U33_E!A24=\"\",\"\",U33_E!A24),IF($AV$7=\"F\",IF(U33_F!A24=\"\",\"\",U33_F!A24),IF($AV$7=\"G\",IF(U33_G!A24=\"\",\"\",U33_G!A24),IF($AV$7=\"H\",IF(U33_H!A24=\"\",\"\",U33_H!A24),\"\")))))))))","v":""},"Le dossier de préparation",null,null,null,null,null,null,null,null,null,null,null,null,null,null,null,null,null,null,null,null,null,{"$f":"IF($AV$7=\"\",\"\",IF($AV$7=\"A\",IF(U33_A!X24=\"\",\"\",U33_A!X24),IF($AV$7=\"B\",IF(U33_B!X24=\"\",\"\",U33_B!X24),IF($AV$7=\"C\",IF(U33_C!X24=\"\",\"\",U33_C!X24),IF($AV$7=\"D\",IF(U33_D!X24=\"\",\"\",U33_D!X24),IF($AV$7=\"E\",IF(U33_E!X24=\"\",\"\",U33_E!X24),IF($AV$7=\"F\",IF(U33_F!X24=\"\",\"\",U33_F!X24),IF($AV$7=\"G\",IF(U33_G!X24=\"\",\"\",U33_G!X24),IF($AV$7=\"H\",IF(U33_H!X24=\"\",\"\",U33_H!X24),\"\")))))))))","v":""},"Le document de recette"]
[{"$f":"IF($AV$7=\"\",\"\",IF($AV$7=\"A\",IF(U33_A!A25=\"\",\"\",U33_A!A25),IF($AV$7=\"B\",IF(U33_B!A25=\"\",\"\",U33_B!A25),IF($AV$7=\"C\",IF(U33_C!A25=\"\",\"\",U33_C!A25),IF($AV$7=\"D\",IF(U33_D!A25=\"\",\"\",U33_D!A25),IF($AV$7=\"E\",IF(U33_E!A25=\"\",\"\",U33_E!A25),IF($AV$7=\"F\",IF(U33_F!A25=\"\",\"\",U33_F!A25),IF($AV$7=\"G\",IF(U33_G!A25=\"\",\"\",U33_G!A25),IF($AV$7=\"H\",IF(U33_H!A25=\"\",\"\",U33_H!A25),\"\")))))))))","v":""},"Les normes",null,null,null,null,null,null,null,null,null,null,null,null,null,null,null,null,null,null,null,null,null,{"$f":"IF($AV$7=\"\",\"\",IF($AV$7=\"A\",IF(U33_A!X25=\"\",\"\",U33_A!X25),IF($AV$7=\"B\",IF(U33_B!X25=\"\",\"\",U33_B!X25),IF($AV$7=\"C\",IF(U33_C!X25=\"\",\"\",U33_C!X25),IF($AV$7=\"D\",IF(U33_D!X25=\"\",\"\",U33_D!X25),IF($AV$7=\"E\",IF(U33_E!X25=\"\",\"\",U33_E!X25),IF($AV$7=\"F\",IF(U33_F!X25=\"\",\"\",U33_F!X25),IF($AV$7=\"G\",IF(U33_G!X25=\"\",\"\",U33_G!X25),IF($AV$7=\"H\",IF(U33_H!X25=\"\",\"\",U33_H!X25),\"\")))))))))","v":""}]
[{"$f":"IF($AV$7=\"\",\"\",IF($AV$7=\"A\",IF(U33_A!A26=\"\",\"\",U33_A!A26),IF($AV$7=\"B\",IF(U33_B!A26=\"\",\"\",U33_B!A26),IF($AV$7=\"C\",IF(U33_C!A26=\"\",\"\",U33_C!A26),IF($AV$7=\"D\",IF(U33_D!A26=\"\",\"\",U33_D!A26),IF($AV$7=\"E\",IF(U33_E!A26=\"\",\"\",U33_E!A26),IF($AV$7=\"F\",IF(U33_F!A26=\"\",\"\",U33_F!A26),IF($AV$7=\"G\",IF(U33_G!A26=\"\",\"\",U33_G!A26),IF($AV$7=\"H\",IF(U33_H!A26=\"\",\"\",U33_H!A26),\"\")))))))))","v":""},"Le Carnet de prescription de sécurité électrique",null,null,null,null,null,null,null,null,null,null,null,null,null,null,null,null,null,null,null,null,null,{"$f":"IF($AV$7=\"\",\"\",IF($AV$7=\"A\",IF(U33_A!X26=\"\",\"\",U33_A!X26),IF($AV$7=\"B\",IF(U33_B!X26=\"\",\"\",U33_B!X26),IF($AV$7=\"C\",IF(U33_C!X26=\"\",\"\",U33_C!X26),IF($AV$7=\"D\",IF(U33_D!X26=\"\",\"\",U33_D!X26),IF($AV$7=\"E\",IF(U33_E!X26=\"\",\"\",U33_E!X26),IF($AV$7=\"F\",IF(U33_F!X26=\"\",\"\",U33_F!X26),IF($AV$7=\"G\",IF(U33_G!X26=\"\",\"\",U33_G!X26),IF($AV$7=\"H\",IF(U33_H!X26=\"\",\"\",U33_H!X26),\"\")))))))))","v":""}]
["     ÇRepérer les données fournies",null,null,null,null,null,null,null,null,null,null,null,null,null,null,null,null,null,null,null,null,null,null,null,"ÇRepérer les données fournies"]
["Travail demandé"]
[{"$f":"IF($AV$7=\"\",\"\",IF($AV$7=\"A\",IF(U33_A!A29=\"\",\"\",U33_A!A29),IF($AV$7=\"B\",IF(U33_B!A29=\"\",\"\",U33_B!A29),IF($AV$7=\"C\",IF(U33_C!A29=\"\",\"\",U33_C!A29),IF($AV$7=\"D\",IF(U33_D!A29=\"\",\"\",U33_D!A29),IF($AV$7=\"E\",IF(U33_E!A29=\"\",\"\",U33_E!A29),IF($AV$7=\"F\",IF(U33_F!A29=\"\",\"\",U33_F!A29),IF($AV$7=\"G\",IF(U33_G!A29=\"\",\"\",U33_G!A29),IF($AV$7=\"H\",IF(U33_H!A29=\"\",\"\",U33_H!A29),\"\")))))))))","v":""},"A1-T1",null,"Réaliser la maintenance corrective - Diagnostiquer les pannes."]
[{"$f":"IF($AV$7=\"\",\"\",IF($AV$7=\"A\",IF(U33_A!A30=\"\",\"\",U33_A!A30),IF($AV$7=\"B\",IF(U33_B!A30=\"\",\"\",U33_B!A30),IF($AV$7=\"C\",IF(U33_C!A30=\"\",\"\",U33_C!A30),IF($AV$7=\"D\",IF(U33_D!A30=\"\",\"\",U33_D!A30),IF($AV$7=\"E\",IF(U33_E!A30=\"\",\"\",U33_E!A30),IF($AV$7=\"F\",IF(U33_F!A30=\"\",\"\",U33_F!A30),IF($AV$7=\"G\",IF(U33_G!A30=\"\",\"\",U33_G!A30),IF($AV$7=\"H\",IF(U33_H!A30=\"\",\"\",U33_H!A30),\"\")))))))))","v":""},"A1-T3",null,"Réaliser la maintenance corrective - Réaliser des réparations, des dépannages dans les domaines : mécanique, électrique, pneumatique, hydraulique. "]
[{"$f":"IF($AV$7=\"\",\"\",IF($AV$7=\"A\",IF(U33_A!A31=\"\",\"\",U33_A!A31),IF($AV$7=\"B\",IF(U33_B!A31=\"\",\"\",U33_B!A31),IF($AV$7=\"C\",IF(U33_C!A31=\"\",\"\",U33_C!A31),IF($AV$7=\"D\",IF(U33_D!A31=\"\",\"\",U33_D!A31),IF($AV$7=\"E\",IF(U33_E!A31=\"\",\"\",U33_E!A31),IF($AV$7=\"F\",IF(U33_F!A31=\"\",\"\",U33_F!A31),IF($AV$7=\"G\",IF(U33_G!A31=\"\",\"\",U33_G!A31),IF($AV$7=\"H\",IF(U33_H!A31=\"\",\"\",U33_H!A31),\"\")))))))))","v":""},"A2-T2",null,"Réaliser la maintenance préventive - Réaliser des opérations planifiées."]
[{"$f":"IF($AV$7=\"\",\"\",IF($AV$7=\"A\",IF(U33_A!A32=\"\",\"\",U33_A!A32),IF($AV$7=\"B\",IF(U33_B!A32=\"\",\"\",U33_B!A32),IF($AV$7=\"C\",IF(U33_C!A32=\"\",\"\",U33_C!A32),IF($AV$7=\"D\",IF(U33_D!A32=\"\",\"\",U33_D!A32),IF($AV$7=\"E\",IF(U33_E!A32=\"\",\"\",U33_E!A32),IF($AV$7=\"F\",IF(U33_F!A32=\"\",\"\",U33_F!A32),IF($AV$7=\"G\",IF(U33_G!A32=\"\",\"\",U33_G!A32),IF($AV$7=\"H\",IF(U33_H!A32=\"\",\"\",U33_H!A32),\"\")))))))))","v":""},"A4-T1",null,"Intégrer de nouveaux biens - Installer de nouveaux biens."]
[{"$f":"IF($AV$7=\"\",\"\",IF($AV$7=\"A\",IF(U33_A!A33=\"\",\"\",U33_A!A33),IF($AV$7=\"B\",IF(U33_B!A33=\"\",\"\",U33_B!A33),IF($AV$7=\"C\",IF(U33_C!A33=\"\",\"\",U33_C!A33),IF($AV$7=\"D\",IF(U33_D!A33=\"\",\"\",U33_D!A33),IF($AV$7=\"E\",IF(U33_E!A33=\"\",\"\",U33_E!A33),IF($AV$7=\"F\",IF(U33_F!A33=\"\",\"\",U33_F!A33),IF($AV$7=\"G\",IF(U33_G!A33=\"\",\"\",U33_G!A33),IF($AV$7=\"H\",IF(U33_H!A33=\"\",\"\",U33_H!A33),\"\")))))))))","v":""},"A4-T2",null,"Intégrer de nouveaux biens - Mettre en service de nouveaux biens"]
["L’ENSEMBLE DES ACTIVITES ET DES TACHES SONT MOBILISEES EN CE QUI CONCERNE LA COMPETENCE CP1.7 QUI A TRAIT A LA SECURITE ET A LA PREVENTION DES RISQUES"]
["Consulter le référentiel des activités professionnelles pour obtenir le détail des tâches."]
["Ç Repérer les tâches demandées (ce sont celles qui correspondent à l’unité dans le référentiel de certification, à l’exclusion de toute autre)"]
["Appréciation globale et proposition de note : "]
[]
["Noms et signatures des évaluateurs :\n\n\n",null,null,null,null,null,null,null,null,null,null,null,null,null,null,null,null,null,null,null,null,null,null,null,null,null,null,null,null,null,null,null,null,null,null,"Note proposée :          ",null,null,null,null,{"$f":"IF(AI169=\"\",\"\",AI169)","v":""},null,null,"/20"]
[null,null,null,null,null,null,null,null,null,null,null,null,null,null,null,null,null,null,null,null,null,null,null,null,null,null,null,null,null,null,null,null,null,null,null,"Note affectée de son coefficient :",null,null,null,null,{"$f":"IF(AO39=\"\",\"\",AO39*3)","v":""},null,null,"/60"]
["Baccalauréat professionnel « maintenance des équipements industriels »  – Unité U 33",null,null,null,null,null,null,null,null,null,null,null,null,null,null,null,null,null,null,null,null,null,null,null,null,null,null,null,null,null,null,null,null,null,"Validé",null,null,null,"-       Synthèse    +"]
[]
["CP 1.1 - Diagnostiquer les pannes",null,null,null,null,null,null,null,null,null,null,null,null,null,null,null,null,null,null,null,null,null,null,null,null,null,null,null,null,null,"Evalué",null,null,null,{"$f":"IF(AE43=\"Non Evalué\",\"NE\",IF(AE43=\"Evalué\",\"E\",\"\"))","v":"E"},{"$f":"COUNTIF(AI45:AL74,\"Validé\")","v":0},{"$f":"COUNTIF(AI45:AL74,\"Non Validé\")","v":0},{"$f":"COUNTIF(AI45:AL74,\"Non Evalué\")","v":0},null,null,null,null,null,null,null,null,null,{"$f":"IF(AE43=\"\",\"Souhaitez-vous évaluer la compétence ?\",IF(AND(AE43=\"Non Evalué\",OR(AJ43<>0,AK43<>0)),\"Vous avez choisi de ne pas évaluer la compétence. Ne rien indiquez dans la colonne Validé.\",IF(AND(AE43=\"Evalué\",OR(AI45=\"\",AI47=\"\",AI49=\"\",AI51=\"\",AI53=\"\",AI55=\"\",AI57=\"\",AI59=\"\",AI61=\"\",AI63=\"\",AI65=\"\",AI67=\"\",AI69=\"\",AI71=\"\",AI73=\"\")),\"Vous avez choisi d'évaluer la compétence. Indiquez pour chaques actions : Validé, Non Validé ou Non Evalué.\",IF(OR(AE43=\"Non Evalué\",(AJ43+AK43)=0),\"\",CONCATENATE(ROUND((100*AJ44/(AJ44+AK44)),0),\" % d'actions validées. \",AJ43,\" validée(s) sur \",AJ43+AK43,\" . Conseil: Au maximum , grisez \",ROUND((100*AJ44/(AJ44+AK44))*8/100,0),\" colonnes\")))))","v":"Vous avez choisi d'évaluer la compétence. Indiquez pour chaques actions : Validé, Non Validé ou Non Evalué."}]
[null,null,null,null,null,null,null,null,null,null,null,null,null,null,null,null,null,null,null,null,null,null,null,null,null,null,null,null,null,null,null,null,null,null,null,{"$f":"SUMPRODUCT((AI45:AL74=\"Validé\")*(Bareme!AE291:AE320))","v":0},{"$f":"SUMPRODUCT((AI45:AL74=\"Non Validé\")*(Bareme!AE291:AE320))","v":0}]
[1,null,"Etablir le constat de défaillance.",null,null,null,null,null,null,null,null,null,null,"Les évènements avant panne sont collectés ",null,null,null,null,null,null,null,null,null,null,null,null,null,null,null,null,null,null,null,null,null,null,null,null,null,null,null,null,null,null,null,null,null,0]
[]
[null,null,null,null,null,null,null,null,null,null,null,null,null,"Les informations délivrées par le système sont relevées."]
[]
[null,null,null,null,null,null,null,null,null,null,null,null,null,"La configuration du bien en panne est  analysée"]
[]
[2,null,"Identifier la fonction défaillante ",null,null,null,null,null,null,null,null,null,null,"La fonction défaillante est repérée"]
[]
[3,null,"Localiser la panne :\n\n• identifier et lister les composants susceptibles d’être défaillants,\n\n• hiérarchiser les hypothèses,\n\n• effectuer les tests, mesures et contrôles permettant de valider ou non les hypothèses.",null,null,null,null,null,null,null,null,null,null,"Les composants sont listés exhaustivement"]
[]
[null,null,null,null,null,null,null,null,null,null,null,null,null,"Les hypothèses sont pertinentes, plausibles et correctement hiérarchisées."]
[]
[null,null,null,null,null,null,null,null,null,null,null,null,null,"Les points de test et de contrôle sont bien choisis et localisés."]
[]
[null,null,null,null,null,null,null,null,null,null,null,null,null,"Les appareils de mesure et de contrôle sont correctement mis en œuvre."]
[]
[null,null,null,null,null,null,null,null,null,null,null,null,null,"Les résultats sont bien interprétés.",null,null,null,null,null,null,null,null,null,null,null,null,null,null,null,null,null,null,null,null,null,null,null,null,"Commentaires:"]
[]
[null,null,null,null,null,null,null,null,null,null,null,null,null,"La chronologie des tests est adaptée en fonction des résultats des contrôles précédents."]
[]
[4,null,"Identifier le composant défectueux.",null,null,null,null,null,null,null,null,null,null,"L’identification du composant est correcte."]
[]
[null,null,null,null,null,null,null,null,null,null,null,null,null,"La durée de la localisation est optimale."]
[]
[5,null,"Expertiser le composant et identifier la cause de la panne.",null,null,null,null,null,null,null,null,null,null,"La cause de la panne est plausible"]
[]
[null,null,null,null,null,null,null,null,null,null,null,null,null,"La demande complémentaire d’expertise du bien est justifiée."]
[]
[null,null,null,null,null,null,null,null,null,null,null,null,null,"La durée du diagnostic est optimale"]
[]
["CP 1.2 - Remettre en état de fonctionnement un bien",null,null,null,null,null,null,null,null,null,null,null,null,null,null,null,null,null,null,null,null,null,null,null,null,null,null,null,null,null,"Evalué",null,null,null,{"$f":"IF(AE75=\"Non Evalué\",\"NE\",IF(AE75=\"Evalué\",\"E\",\"\"))","v":"E"},{"$f":"COUNTIF(AI77:AL90,\"Validé\")","v":0},{"$f":"COUNTIF(AI77:AL90,\"Non Validé\")","v":0},{"$f":"COUNTIF(AI77:AL90,\"Non Evalué\")","v":0},null,null,null,null,null,null,null,null,null,{"$f":"IF(AE75=\"\",\"Souhaitez-vous évaluer la compétence ?\",IF(AND(AE75=\"Non Evalué\",OR(AJ75<>0,AK75<>0)),\"Vous avez choisi de ne pas évaluer la compétence. Ne rien indiquez dans la colonne Validé.\",IF(AND(AE75=\"Evalué\",OR(AI77=\"\",AI79=\"\",AI81=\"\",AI83=\"\",AI85=\"\",AI87=\"\",AI89=\"\")),\"Vous avez choisi d'évaluer la compétence. Indiquez pour chaques actions : Validé, Non Validé ou Non Evalué.\",IF(OR(AE75=\"Non Evalué\",(AJ75+AK75)=0),\"\",CONCATENATE(ROUND((100*AJ76/(AJ76+AK76)),0),\" % d'actions validées. \",AJ75,\" validée(s) sur \",AJ75+AK75,\" . Conseil: Au maximum , grisez \",ROUND((100*AJ76/(AJ76+AK76))*8/100,0),\" colonnes\")))))","v":"Vous avez choisi d'évaluer la compétence. Indiquez pour chaques actions : Validé, Non Validé ou Non Evalué."}]
[null,null,null,null,null,null,null,null,null,null,null,null,null,null,null,null,null,null,null,null,null,null,null,null,null,null,null,null,null,null,null,null,null,null,null,{"$f":"SUMPRODUCT((AI77:AL90=\"Validé\")*(Bareme!AE323:AE336))","v":0},{"$f":"SUMPRODUCT((AI77:AL90=\"Non Validé\")*(Bareme!AE323:AE336))","v":0}]
[1,null,"Situer le composant défectueux sur le bien.",null,null,null,null,null,null,null,null,null,null,"Le composant est repéré rapidement sur le bien",null,null,null,null,null,null,null,null,null,null,null,null,null,null,null,null,null,null,null,null,null,null,null,null,null,null,null,null,null,null,null,null,null,0]
[]
[2,null,"Rassembler et vérifier les outillages et matériels nécessaires.",null,null,null,null,null,null,null,null,null,null,"Les moyens rassemblés sont en bon état et adaptés à l’intervention."]
[]
[3,null,"Consigner tout ou partie du bien.",null,null,null,null,null,null,null,null,null,null,"Le bien est consigné dans le respect de la réglementation et des procédures."]
[]
[4,null,"Effectuer la dépose du composant défectueux.",null,null,null,null,null,null,null,null,null,null,"Les consignes et procédures sont respectées."]
[null,null,null,null,null,null,null,null,null,null,null,null,null,null,null,null,null,null,null,null,null,null,null,null,null,null,null,null,null,null,null,null,null,null,null,null,null,null,"Commentaires:\n"]
[null,null,null,null,null,null,null,null,null,null,null,null,null,"Les moyens de manutention et l’outillage sont mis en œuvre correctement et en toute sécurité."]
[]
[5,null,"Installer et régler le composant de remplacement.",null,null,null,null,null,null,null,null,null,null,"Le composant est remplacé sans risque pour les personnes et le bien."]
[]
[6,null,"Mettre en service le bien.",null,null,null,null,null,null,null,null,null,null,"Les performances du bien sont conformes au cahier des charges"]
[]
["Baccalauréat professionnel « maintenance des équipements industriels »  – Unité U 33",null,null,null,null,null,null,null,null,null,null,null,null,null,null,null,null,null,null,null,null,null,null,null,null,null,null,null,null,null,null,null,null,null,"Validé",null,null,null,"-       Synthèse    +"]
[]
["CP 1.6 - Mettre en service un bien dans le respect des procédures",null,null,null,null,null,null,null,null,null,null,null,null,null,null,null,null,null,null,null,null,null,null,null,null,null,null,null,null,null,"Evalué",null,null,null,{"$f":"IF(AE93=\"Non Evalué\",\"NE\",IF(AE93=\"Evalué\",\"E\",\"\"))","v":"E"},{"$f":"COUNTIF(AI95:AL122,\"Validé\")","v":0},{"$f":"COUNTIF(AI95:AL122,\"Non Validé\")","v":0},{"$f":"COUNTIF(AI95:AL122,\"Non Evalué\")","v":0},null,null,null,null,null,null,null,null,null,{"$f":"IF(AE93=\"\",\"Souhaitez-vous évaluer la compétence ?\",IF(AND(AE93=\"Non Evalué\",OR(AJ93<>0,AK93<>0)),\"Vous avez choisi de ne pas évaluer la compétence. Ne rien indiquez dans la colonne Validé.\",IF(AND(AE93=\"Evalué\",OR(AI95=\"\",AI97=\"\",AI99=\"\",AI101=\"\",AI103=\"\",AI105=\"\",AI107=\"\",AI109=\"\",AI111=\"\",AI113=\"\",AI115=\"\",AI117=\"\",AI119=\"\",AI121=\"\")),\"Vous avez choisi d'évaluer la compétence. Indiquez pour chaques actions : Validé, Non Validé ou Non Evalué.\",IF(OR(AE93=\"Non Evalué\",(AJ93+AK93)=0),\"\",CONCATENATE(ROUND((100*AJ94/(AJ94+AK94)),0),\" % d'actions validées. \",AJ93,\" validée(s) sur \",AJ93+AK93,\" . Conseil: Au maximum , grisez \",ROUND((100*AJ94/(AJ94+AK94))*8/100,0),\" colonnes\")))))","v":"Vous avez choisi d'évaluer la compétence. Indiquez pour chaques actions : Validé, Non Validé ou Non Evalué."}]
[null,null,null,null,null,null,null,null,null,null,null,null,null,null,null,null,null,null,null,null,null,null,null,null,null,null,null,null,null,null,null,null,null,null,null,{"$f":"SUMPRODUCT((AI95:AL122=\"Validé\")*(Bareme!AE339:AE366))","v":0},{"$f":"SUMPRODUCT((AI95:AL122=\"Non Validé\")*(Bareme!AE339:AE366))","v":0}]
[1,null,"Préparer le bien pour une mise en service.",null,null,null,null,null,null,null,null,null,null,"Les zones d’actions des effecteurs et la zone de travail sont propres et dégagées.",null,null,null,null,null,null,null,null,null,null,null,null,null,null,null,null,null,null,null,null,null,null,null,null,null,null,null,null,null,null,null,null,null,0]
[]
[null,null,null,null,null,null,null,null,null,null,null,null,null,"La vérification des scellements et la géométrie des biens sont réalisées."]
[]
[2,null,"S’informer sur le régime du neutre installé",null,null,null,null,null,null,null,null,null,null,"Le régime du neutre est identifié."]
[]
[3,null,"Vérifier les mises à la terre.",null,null,null,null,null,null,null,null,null,null,"Les mises à la terre sont  vérifiées."]
[null,null,null,null,null,null,null,null,null,null,null,null,null,null,null,null,null,null,null,null,null,null,null,null,null,null,null,null,null,null,null,null,null,null,null,null,null,null,"Commentaires:\n"]
[4,null,"Déconsigner tout ou partie du bien.",null,null,null,null,null,null,null,null,null,null,"Les procédures de déconsignation sont respectées"]
[]
[5,null,"Vérifier la présence et les niveaux des énergies d’alimentation.",null,null,null,null,null,null,null,null,null,null,"La présence et les niveaux des énergies sont identifiés et conformes au cahier des charges."]
[]
[6,null,"S’approprier les différentes procédures de mise en service et de sécurité.",null,null,null,null,null,null,null,null,null,null,"Les descriptifs des différents modes de marche et d’arrêt, le document unique d’évaluation des risques et le plan de prévention sont lus et interprétés sans erreur."]
[]
[7,null,"Vérifier l’efficacité de la chaîne de sécurité",null,null,null,null,null,null,null,null,null,null,"Les arrêts d’urgence et les éléments de sécurité sont vérifiés et efficaces."]
[]
[8,null,"Participer à la mise en œuvre des procédures de préparation.",null,null,null,null,null,null,null,null,null,null,"Le bien est approvisionné dans ses différentes matières d’œuvre, les effecteurs sont prêts à opérer."]
[]
[9,null,"\nMettre le bien en position initiale.\n\nDémarrer ou participer au démarrage du bien.\n\n",null,null,null,null,null,null,null,null,null,null,"Le bien est mis en position initiale en toute sécurité."]
[]
[null,null,null,null,null,null,null,null,null,null,null,null,null,"Le bien fonctionne."]
[]
[null,null,null,null,null,null,null,null,null,null,null,null,null,"Les performances du bien et la matière d’œuvre sortante ou le    service sont vérifiés et conformes au cahier des charges."]
[]
[10,null,"Vérifier le bon fonctionnement des différents modes de marche et d’arrêt.",null,null,null,null,null,null,null,null,null,null,"Les différents modes de marche et d’arrêt sont vérifiés"]
[]
[11,null,"Transmettre éventuellement les nouvelles consignes à l’utilisateur et lui remettre le bien",null,null,null,null,null,null,null,null,null,null,"Les nouvelles consignes sont transmises sans équivoque et le bien est remis à l’utilisateur."]
[]
["CP 1.7 - Identifier les risques, définir et mettre en œuvre les mesures de prévention adaptées",null,null,null,null,null,null,null,null,null,null,null,null,null,null,null,null,null,null,null,null,null,null,null,null,null,null,null,null,null,"Evalué",null,null,null,{"$f":"IF(AE123=\"Non Evalué\",\"NE\",IF(AE123=\"Evalué\",\"E\",\"\"))","v":"E"},{"$f":"COUNTIF(AI125:AL140,\"Validé\")","v":0},{"$f":"COUNTIF(AI125:AL140,\"Non Validé\")","v":0},{"$f":"COUNTIF(AI125:AL140,\"Non Evalué\")","v":0},null,null,null,null,null,null,null,null,null,{"$f":"IF(AE123=\"\",\"Souhaitez-vous évaluer la compétence ?\",IF(AND(AE123=\"Non Evalué\",OR(AJ123<>0,AK123<>0)),\"Vous avez choisi de ne pas évaluer la compétence. Ne rien indiquez dans la colonne Validé.\",IF(AND(AE123=\"Evalué\",OR(AI125=\"\",AI127=\"\",AI129=\"\",AI131=\"\",AI133=\"\",AI135=\"\",AI137=\"\",AI139=\"\")),\"Vous avez choisi d'évaluer la compétence. Indiquez pour chaques actions : Validé, Non Validé ou Non Evalué.\",IF(OR(AE123=\"Non Evalué\",(AJ123+AK123)=0),\"\",CONCATENATE(ROUND((100*AJ124/(AJ124+AK124)),0),\" % d'actions validées. \",AJ123,\" validée(s) sur \",AJ123+AK123,\" . Conseil: Au maximum , grisez \",ROUND((100*AJ124/(AJ124+AK124))*8/100,0),\" colonnes\")))))","v":"Vous avez choisi d'évaluer la compétence. Indiquez pour chaques actions : Validé, Non Validé ou Non Evalué."}]
[null,null,null,null,null,null,null,null,null,null,null,null,null,null,null,null,null,null,null,null,null,null,null,null,null,null,null,null,null,null,null,null,null,null,null,{"$f":"SUMPRODUCT((AI125:AL140=\"Validé\")*(Bareme!AE369:AE384))","v":0},{"$f":"SUMPRODUCT((AI125:AL140=\"Non Validé\")*(Bareme!AE369:AE384))","v":0}]
[1,null,"Identifier les phénomènes dangereux et les situations dangereuses ",null,null,null,null,null,null,null,null,null,null,"Les phénomènes dangereux et les situations dangereuses liés au bien, à son environnement et à l’activité sont identifiés.",null,null,null,null,null,null,null,null,null,null,null,null,null,null,null,null,null,null,null,null,null,null,null,null,null,null,null,null,null,null,null,null,null,0]
[]
[2,null,"Déterminer les mesures de prévention en regard des situations dangereuses identifiées dans l’acte de maintenance",null,null,null,null,null,null,null,null,null,null,"Les mesures de prévention définies sont adaptées aux situations dangereuses identifiées"]
[]
[3,null,"Mettre en œuvre les E.P.I.",null,null,null,null,null,null,null,null,null,null,"La mise en œuvre des E.P.I. est correcte.",null,null,null,null,null,null,null,null,null,null,null,null,null,null,null,null,null,null,null,null,null,null,null,null,"Commentaires:\n"]
[]
[4,null,"Mettre en œuvre les E.P.C.",null,null,null,null,null,null,null,null,null,null,"La mise en œuvre des E.P.C. est correcte."]
[]
[5,null,"Utiliser des équipements individuels de sécurité (EIS)",null,null,null,null,null,null,null,null,null,null,"La mise en œuvre des E.I.S. est correcte."]
[]
[6,null,"Consigner (energie,accés…)   Respecter les procédures",null,null,null,null,null,null,null,null,null,null,"Les procédures de mise en œuvre des équipements et des outillages sont conformes"]
[]
[7,null,"Proposer des modifications au plan de prévention.",null,null,null,null,null,null,null,null,null,null,"Les propositions permettent:\n- de se prémunir de situations ou de phénomènes dangereux résiduels identifiés."]
[]
[null,null,null,null,null,null,null,null,null,null,null,null,null,"Les propositions permettent:\n- d’améliorer les mesures de prévention préconisées."]
[]
[]
[]
[]
[]
[]
[]
[]
[]
[]
[]
[]
[]
[]
[]
[]
[]
[]
[]
[]
[]
[]
[]
[]
[]
[]
[null,null,null,null,{"$f":"IF(OR(J178=\"\",(AND(AE43=\"\",AE75=\"\",AE93=\"\",AE123=\"\"))=0),\"\",CONCATENATE(\"PROPOSITION: \",CEILING(J178,0.5),\"/20 (\",ROUND(100*COUNTIF(V176:V179,\"E\")/(COUNTIF(V176:V179,\"E\")+COUNTIF(V176:V179,\"NE\")),0),\"% des compétences évaluées).\"))","v":"PROPOSITION: 0/20 (100% des compétences évaluées)."}]
[]
[]
[null,null,null,null,"Proposition des évaluateurs:"]
[]
[]
[]
[null,null,"Ne pas effacer"]
[null,null,null,null,null,null,null,null,null,null,null,null,null,null,null,{"$f":"CONCATENATE(\"Statistique U33 de \",$AE$4)","v":{"$error":"#N/A"}}]
[null,null,null,null,null,null,null,null,null,null,null,null,null,null,null,"Compétences",{"$f":"IF(AE4=\"\",\"\",AE4)","v":{"$error":"#N/A"}},"Satisfaction maximale","Satisfaction moyenne",{"$f":"CONCATENATE(\"Statistique U31 de \",$AE$4)","v":{"$error":"#N/A"}},"Coefficients","Validée ou Non Validée"]
[null,null,null,"Somme",null,null,null,null,null,{"$f":"SUM((Q176:Q179))","v":0},null,{"$f":"SUM(R176:R179)","v":800},null,null,null,{"$f":"A43","v":"CP 1.1 - Diagnostiquer les pannes"},{"$f":"IF(OR(V176=\"NE\",V176=\"\"),\"\",T176*U176)","v":0},{"$f":"IF(OR(V176=\"NE\",V176=\"\"),\"\",U176*8)","v":320},{"$f":"IF(OR(V176=\"NE\",V176=\"\"),\"\",R176/2)","v":160},{"$f":"IF($AV$45=\"\",\"\",$AV$45)","v":0},{"$f":"Bareme!AE289","v":40},{"$f":"IF(AI43=\"\",\"\",AI43)","v":"E"}]
[null,null,null,null,null,null,null,null,null,null,null,null,null,null,null,{"$f":"A75","v":"CP 1.2 - Remettre en état de fonctionnement un bien"},{"$f":"IF(OR(V177=\"NE\",V177=\"\"),\"\",T177*U177)","v":0},{"$f":"IF(OR(V177=\"NE\",V177=\"\"),\"\",U177*8)","v":160},{"$f":"IF(OR(V177=\"NE\",V177=\"\"),\"\",R177/2)","v":80},{"$f":"IF($AV$77=\"\",\"\",$AV$77)","v":0},{"$f":"Bareme!AE321","v":20},{"$f":"IF(AI75=\"\",\"\",AI75)","v":"E"}]
[null,null,null,"Moyenne /20",null,null,null,null,null,{"$f":"IF($L$176=0,\"\",L178*$J$176/$L$176)","v":0},null,20,null,null,null,{"$f":"A93","v":"CP 1.6 - Mettre en service un bien dans le respect des procédures"},{"$f":"IF(OR(V178=\"NE\",V178=\"\"),\"\",T178*U178)","v":0},{"$f":"IF(OR(V178=\"NE\",V178=\"\"),\"\",U178*8)","v":160},{"$f":"IF(OR(V178=\"NE\",V178=\"\"),\"\",R178/2)","v":80},{"$f":"IF($AV$95=\"\",\"\",$AV$95)","v":0},{"$f":"Bareme!AE337","v":20},{"$f":"IF(AI93=\"\",\"\",AI93)","v":"E"}]
[null,null,null,null,null,null,null,null,null,null,null,null,null,null,null,{"$f":"A123","v":"CP 1.7 - Identifier les risques, définir et mettre en œuvre les mesures de prévention adaptées"},0,160,80,{"$f":"IF($AV$125=\"\",\"\",$AV$125)","v":0},{"$f":"Bareme!AE367","v":20},{"$f":"IF(AI123=\"\",\"\",AI123)","v":"E"}]
[null,null,null,"Moyenne /40",null,null,null,null,null,{"$f":"IF($L$176=0,\"\",L180*$J$176/$L$176)","v":0},null,60]
[]
[null,null,null,"Ne pas effacer"]

{"sheet":"U11_A","index":9,"n_rows":32,"n_cols":49,"rows_kept":32,"cut":false,"hidden":true,"merged":[[5,47,6,48],[7,48,8,48],[7,47,8,47],[28,0,28,45],[29,0,29,45],[26,0,26,45],[23,1,23,2],[25,1,25,2],[23,3,23,45],[24,3,24,45],[25,3,25,45],[24,1,24,2],[22,0,22,45],[18,1,18,22],[18,24,18,45],[19,1,19,22],[30,0,31,34],[30,35,30,39],[30,40,30,42],[30,43,30,45],[31,35,31,39],[31,40,31,42],[31,43,31,45],[19,24,19,45],[20,1,20,22],[20,24,20,45],[15,1,15,22],[15,24,15,45],[16,1,16,22],[16,24,16,45],[17,1,17,22],[17,24,17,45],[12,0,12,45],[13,1,13,22],[13,24,13,45],[14,1,14,22],[14,24,14,45],[6,0,6,45],[7,0,7,45],[8,0,8,45],[9,0,9,45],[10,0,10,45],[3,0,5,22],[3,23,3,29],[3,30,4,45],[4,23,4,29],[5,23,5,29],[5,30,5,45],[0,0,0,45],[1,0,1,45],[2,0,2,22],[2,23,2,29],[2,30,2,45]]}
["Baccalauréat professionnel « maintenance des équipements industriels »"]
["Épreuve E11 (Unité U11) : ANALYSE ET EXPLOITATION DE DONNEES TECHNIQUES"]
["Établissement : (tampon)",null,null,null,null,null,null,null,null,null,null,null,null,null,null,null,null,null,null,null,null,null,null,"Session : "]
[null,null,null,null,null,null,null,null,null,null,null,null,null,null,null,null,null,null,null,null,null,null,null,"Nom du candidat:"]
[null,null,null,null,null,null,null,null,null,null,null,null,null,null,null,null,null,null,null,null,null,null,null,"Prénom : "]
[null,null,null,null,null,null,null,null,null,null,null,null,null,null,null,null,null,null,null,null,null,null,null,"Date de l'évaluation:",null,null,null,null,null,null,null,null,null,null,null,null,null,null,null,null,null,null,null,null,null,null,null,"Situation d'évaluation :"]
["Lieu d’évaluation :"]
["      Etablissement",null,null,null,null,null,null,null,null,null,null,null,null,null,null,null,null,null,null,null,null,null,null,null,null,null,null,null,null,null,null,null,null,null,null,null,null,null,null,null,null,null,null,null,null,null,null,"E 11","A"]
["      Entreprise :       "]
["Description sommaire du travail demandé :"]
[]
["fh"]
["Données fournies au candidat"]
["X","Le dossier technique du bien sur supports papiers ou supports numériques",null,null,null,null,null,null,null,null,null,null,null,null,null,null,null,null,null,null,null,null,null,"X","Le cahier des charges fonctionnel"]
["X","Le bien et les conditions de son environnement",null,null,null,null,null,null,null,null,null,null,null,null,null,null,null,null,null,null,null,null,null,"X","Equipement informatique"]
["X","Les normes",null,null,null,null,null,null,null,null,null,null,null,null,null,null,null,null,null,null,null,null,null,"X","Les logiciels"]
["X","Toutes documentations techniques",null,null,null,null,null,null,null,null,null,null,null,null,null,null,null,null,null,null,null,null,null,"X","Le plan de prévention"]
["X","Document unique d’évaluation des risques"]
[]
[]
[]
["     ÇRepérer les données fournies",null,null,null,null,null,null,null,null,null,null,null,null,null,null,null,null,null,null,null,null,null,null,null,"ÇRepérer les données fournies"]
["Travail demandé"]
["X","A1-T1",null,"Réaliser la maintenance corrective - Diagnostiquer les pannes."]
["X","A1-T2",null,"Réaliser la maintenance corrective - Préparer sa réparation, son dépannage. "]
["X","A1-T3",null,"Réaliser la maintenance corrective - Réaliser des réparations, des dépannages dans les domaines : mécanique, électrique, pneumatique, hydraulique."]
["Consulter le référentiel des activités professionnelles pour obtenir le détail des tâches."]
["Ç Repérer les tâches demandées (ce sont celles qui correspondent à l’unité dans le référentiel de certification, à l’exclusion de toute autre)"]
["Appréciation globale et proposition de note : "]
[]
["Noms et signatures des évaluateurs :\n\n\n",null,null,null,null,null,null,null,null,null,null,null,null,null,null,null,null,null,null,null,null,null,null,null,null,null,null,null,null,null,null,null,null,null,null,"Note proposée :          ",null,null,null,null,null,null,null,"/20"]
[null,null,null,null,null,null,null,null,null,null,null,null,null,null,null,null,null,null,null,null,null,null,null,null,null,null,null,null,null,null,null,null,null,null,null,"Note affectée de son coefficient :",null,null,null,null,null,null,null,"/60"]

{"sheet":"U11_B","index":10,"n_rows":32,"n_cols":49,"rows_kept":32,"cut":false,"hidden":true,"merged":[[10,0,10,45],[12,0,12,45],[13,1,13,22],[13,24,13,45],[29,0,29,45],[24,1,24,2],[24,3,24,45],[25,1,25,2],[25,3,25,45],[26,0,26,45],[18,1,18,22],[18,24,18,45],[19,1,19,22],[19,24,19,45],[20,1,20,22],[20,24,20,45],[30,0,31,34],[30,35,30,39],[30,40,30,42],[28,0,28,45],[30,43,30,45],[31,35,31,39],[31,40,31,42],[31,43,31,45],[22,0,22,45],[23,1,23,2],[23,3,23,45],[14,1,14,22],[14,24,14,45],[15,1,15,22],[15,24,15,45],[16,1,16,22],[16,24,16,45],[17,1,17,22],[17,24,17,45],[9,0,9,45],[0,0,0,45],[1,0,1,45],[2,0,2,22],[2,23,2,29],[2,30,2,45],[5,30,5,45],[5,47,6,48],[6,0,6,45],[7,0,7,45],[7,47,8,47],[7,48,8,48],[8,0,8,45],[3,0,5,22],[3,23,3,29],[3,30,4,45],[4,23,4,29],[5,23,5,29]]}
["Baccalauréat professionnel « maintenance des équipements industriels »"]
["Épreuve E11 (Unité U11) : ANALYSE ET EXPLOITATION DE DONNEES TECHNIQUES"]
["Établissement : (tampon)",null,null,null,null,null,null,null,null,null,null,null,null,null,null,null,null,null,null,null,null,null,null,"Session : "]
[null,null,null,null,null,null,null,null,null,null,null,null,null,null,null,null,null,null,null,null,null,null,null,"Nom du candidat:"]
[null,null,null,null,null,null,null,null,null,null,null,null,null,null,null,null,null,null,null,null,null,null,null,"Prénom : "]
[null,null,null,null,null,null,null,null,null,null,null,null,null,null,null,null,null,null,null,null,null,null,null,"Date de l'évaluation:",null,null,null,null,null,null,null,null,null,null,null,null,null,null,null,null,null,null,null,null,null,null,null,"Situation d'évaluation :"]
["Lieu d’évaluation :"]
["      Etablissement",null,null,null,null,null,null,null,null,null,null,null,null,null,null,null,null,null,null,null,null,null,null,null,null,null,null,null,null,null,null,null,null,null,null,null,null,null,null,null,null,null,null,null,null,null,null,"E 11","B"]
["      Entreprise :       "]
["Description sommaire du travail demandé :"]
[]
["fh"]
["Données fournies au candidat"]
["X","Le dossier technique du bien sur supports papiers ou supports numériques",null,null,null,null,null,null,null,null,null,null,null,null,null,null,null,null,null,null,null,null,null,"X","Le cahier des charges fonctionnel"]
["X","Le bien et les conditions de son environnement",null,null,null,null,null,null,null,null,null,null,null,null,null,null,null,null,null,null,null,null,null,"X","Equipement informatique"]
["X","Les normes",null,null,null,null,null,null,null,null,null,null,null,null,null,null,null,null,null,null,null,null,null,"X","Les logiciels"]
["X","Toutes documentations techniques",null,null,null,null,null,null,null,null,null,null,null,null,null,null,null,null,null,null,null,null,null,"X","Le plan de prévention"]
["X","Document unique d’évaluation des risques"]
[]
[]
[]
["     ÇRepérer les données fournies",null,null,null,null,null,null,null,null,null,null,null,null,null,null,null,null,null,null,null,null,null,null,null,"ÇRepérer les données fournies"]
["Travail demandé"]
["X","A1-T1",null,"Réaliser la maintenance corrective - Diagnostiquer les pannes."]
["X","A1-T2",null,"Réaliser la maintenance corrective - Préparer sa réparation, son dépannage. "]
["X","A1-T3",null,"Réaliser la maintenance corrective - Réaliser des réparations, des dépannages dans les domaines : mécanique, électrique, pneumatique, hydraulique."]
["Consulter le référentiel des activités professionnelles pour obtenir le détail des tâches."]
["Ç Repérer les tâches demandées (ce sont celles qui correspondent à l’unité dans le référentiel de certification, à l’exclusion de toute autre)"]
["Appréciation globale et proposition de note : "]
[]
["Noms et signatures des évaluateurs :\n\n\n",null,null,null,null,null,null,null,null,null,null,null,null,null,null,null,null,null,null,null,null,null,null,null,null,null,null,null,null,null,null,null,null,null,null,"Note proposée :          ",null,null,null,null,null,null,null,"/20"]
[null,null,null,null,null,null,null,null,null,null,null,null,null,null,null,null,null,null,null,null,null,null,null,null,null,null,null,null,null,null,null,null,null,null,null,"Note affectée de son coefficient :",null,null,null,null,null,null,null,"/60"]

{"sheet":"U11_C","index":11,"n_rows":32,"n_cols":49,"rows_kept":32,"cut":false,"hidden":true,"merged":[[12,0,12,45],[13,1,13,22],[13,24,13,45],[29,0,29,45],[30,0,31,34],[30,35,30,39],[30,40,30,42],[28,0,28,45],[30,43,30,45],[31,35,31,39],[31,40,31,42],[31,43,31,45],[24,1,24,2],[24,3,24,45],[25,1,25,2],[25,3,25,45],[26,0,26,45],[18,1,18,22],[18,24,18,45],[19,1,19,22],[19,24,19,45],[20,1,20,22],[20,24,20,45],[22,0,22,45],[23,1,23,2],[23,3,23,45],[17,1,17,22],[17,24,17,45],[9,0,9,45],[10,0,10,45],[0,0,0,45],[1,0,1,45],[2,0,2,22],[2,23,2,29],[2,30,2,45],[5,30,5,45],[14,1,14,22],[14,24,14,45],[15,1,15,22],[15,24,15,45],[16,1,16,22],[16,24,16,45],[5,47,6,48],[6,0,6,45],[7,0,7,45],[7,47,8,47],[7,48,8,48],[8,0,8,45],[3,0,5,22],[3,23,3,29],[3,30,4,45],[4,23,4,29],[5,23,5,29]]}
["Baccalauréat professionnel « maintenance des équipements industriels »"]
["Épreuve E11 (Unité U11) : ANALYSE ET EXPLOITATION DE DONNEES TECHNIQUES"]
["Établissement : (tampon)",null,null,null,null,null,null,null,null,null,null,null,null,null,null,null,null,null,null,null,null,null,null,"Session : "]
[null,null,null,null,null,null,null,null,null,null,null,null,null,null,null,null,null,null,null,null,null,null,null,"Nom du candidat:"]
[null,null,null,null,null,null,null,null,null,null,null,null,null,null,null,null,null,null,null,null,null,null,null,"Prénom : "]
[null,null,null,null,null,null,null,null,null,null,null,null,null,null,null,null,null,null,null,null,null,null,null,"Date de l'évaluation:",null,null,null,null,null,null,null,null,null,null,null,null,null,null,null,null,null,null,null,null,null,null,null,"Situation d'évaluation :"]
["Lieu d’évaluation :"]
["      Etablissement",null,null,null,null,null,null,null,null,null,null,null,null,null,null,null,null,null,null,null,null,null,null,null,null,null,null,null,null,null,null,null,null,null,null,null,null,null,null,null,null,null,null,null,null,null,null,"E 11","C"]
["      Entreprise :       "]
["Description sommaire du travail demandé :"]
[]
["fh"]
["Données fournies au candidat"]
["X","Le dossier technique du bien sur supports papiers ou supports numériques",null,null,null,null,null,null,null,null,null,null,null,null,null,null,null,null,null,null,null,null,null,"X","Le cahier des charges fonctionnel"]
["X","Le bien et les conditions de son environnement",null,null,null,null,null,null,null,null,null,null,null,null,null,null,null,null,null,null,null,null,null,"X","Equipement informatique"]
["X","Les normes",null,null,null,null,null,null,null,null,null,null,null,null,null,null,null,null,null,null,null,null,null,"X","Les logiciels"]
["X","Toutes documentations techniques",null,null,null,null,null,null,null,null,null,null,null,null,null,null,null,null,null,null,null,null,null,"X","Le plan de prévention"]
["X","Document unique d’évaluation des risques"]
[]
[]
[]
["     ÇRepérer les données fournies",null,null,null,null,null,null,null,null,null,null,null,null,null,null,null,null,null,null,null,null,null,null,null,"ÇRepérer les données fournies"]
["Travail demandé"]
["X","A1-T1",null,"Réaliser la maintenance corrective - Diagnostiquer les pannes."]
["X","A1-T2",null,"Réaliser la maintenance corrective - Préparer sa réparation, son dépannage. "]
["X","A1-T3",null,"Réaliser la maintenance corrective - Réaliser des réparations, des dépannages dans les domaines : mécanique, électrique, pneumatique, hydraulique."]
["Consulter le référentiel des activités professionnelles pour obtenir le détail des tâches."]
["Ç Repérer les tâches demandées (ce sont celles qui correspondent à l’unité dans le référentiel de certification, à l’exclusion de toute autre)"]
["Appréciation globale et proposition de note : "]
[]
["Noms et signatures des évaluateurs :\n\n\n",null,null,null,null,null,null,null,null,null,null,null,null,null,null,null,null,null,null,null,null,null,null,null,null,null,null,null,null,null,null,null,null,null,null,"Note proposée :          ",null,null,null,null,null,null,null,"/20"]
[null,null,null,null,null,null,null,null,null,null,null,null,null,null,null,null,null,null,null,null,null,null,null,null,null,null,null,null,null,null,null,null,null,null,null,"Note affectée de son coefficient :",null,null,null,null,null,null,null,"/60"]

{"sheet":"U11_D","index":12,"n_rows":32,"n_cols":49,"rows_kept":32,"cut":false,"hidden":true,"merged":[[26,0,26,45],[29,0,29,45],[30,0,31,34],[30,35,30,39],[30,40,30,42],[28,0,28,45],[30,43,30,45],[31,35,31,39],[31,40,31,42],[31,43,31,45],[20,24,20,45],[24,1,24,2],[24,3,24,45],[25,1,25,2],[25,3,25,45],[22,0,22,45],[23,1,23,2],[23,3,23,45],[20,1,20,22],[14,1,14,22],[14,24,14,45],[15,1,15,22],[15,24,15,45],[16,1,16,22],[16,24,16,45],[17,1,17,22],[17,24,17,45],[18,1,18,22],[18,24,18,45],[19,1,19,22],[19,24,19,45],[9,0,9,45],[10,0,10,45],[12,0,12,45],[13,1,13,22],[13,24,13,45],[0,0,0,45],[1,0,1,45],[2,0,2,22],[2,23,2,29],[2,30,2,45],[5,30,5,45],[5,47,6,48],[6,0,6,45],[7,0,7,45],[7,47,8,47],[7,48,8,48],[8,0,8,45],[3,0,5,22],[3,23,3,29],[3,30,4,45],[4,23,4,29],[5,23,5,29]]}
["Baccalauréat professionnel « maintenance des équipements industriels »"]
["Épreuve E11 (Unité U11) : ANALYSE ET EXPLOITATION DE DONNEES TECHNIQUES"]
["Établissement : (tampon)",null,null,null,null,null,null,null,null,null,null,null,null,null,null,null,null,null,null,null,null,null,null,"Session : "]
[null,null,null,null,null,null,null,null,null,null,null,null,null,null,null,null,null,null,null,null,null,null,null,"Nom du candidat:"]
[null,null,null,null,null,null,null,null,null,null,null,null,null,null,null,null,null,null,null,null,null,null,null,"Prénom : "]
[null,null,null,null,null,null,null,null,null,null,null,null,null,null,null,null,null,null,null,null,null,null,null,"Date de l'évaluation:",null,null,null,null,null,null,null,null,null,null,null,null,null,null,null,null,null,null,null,null,null,null,null,"Situation d'évaluation :"]
["Lieu d’évaluation :"]
["      Etablissement",null,null,null,null,null,null,null,null,null,null,null,null,null,null,null,null,null,null,null,null,null,null,null,null,null,null,null,null,null,null,null,null,null,null,null,null,null,null,null,null,null,null,null,null,null,null,"E 11","D"]
["      Entreprise :       "]
["Description sommaire du travail demandé :"]
[]
["fh"]
["Données fournies au candidat"]
["X","Le dossier technique du bien sur supports papiers ou supports numériques",null,null,null,null,null,null,null,null,null,null,null,null,null,null,null,null,null,null,null,null,null,"X","Le cahier des charges fonctionnel"]
["X","Le bien et les conditions de son environnement",null,null,null,null,null,null,null,null,null,null,null,null,null,null,null,null,null,null,null,null,null,"X","Equipement informatique"]
["X","Les normes",null,null,null,null,null,null,null,null,null,null,null,null,null,null,null,null,null,null,null,null,null,"X","Les logiciels"]
["X","Toutes documentations techniques",null,null,null,null,null,null,null,null,null,null,null,null,null,null,null,null,null,null,null,null,null,"X","Le plan de prévention"]
["X","Document unique d’évaluation des risques"]
[]
[]
[]
["     ÇRepérer les données fournies",null,null,null,null,null,null,null,null,null,null,null,null,null,null,null,null,null,null,null,null,null,null,null,"ÇRepérer les données fournies"]
["Travail demandé"]
["X","A1-T1",null,"Réaliser la maintenance corrective - Diagnostiquer les pannes."]
["X","A1-T2",null,"Réaliser la maintenance corrective - Préparer sa réparation, son dépannage. "]
["X","A1-T3",null,"Réaliser la maintenance corrective - Réaliser des réparations, des dépannages dans les domaines : mécanique, électrique, pneumatique, hydraulique."]
["Consulter le référentiel des activités professionnelles pour obtenir le détail des tâches."]
["Ç Repérer les tâches demandées (ce sont celles qui correspondent à l’unité dans le référentiel de certification, à l’exclusion de toute autre)"]
["Appréciation globale et proposition de note : "]
[]
["Noms et signatures des évaluateurs :\n\n\n",null,null,null,null,null,null,null,null,null,null,null,null,null,null,null,null,null,null,null,null,null,null,null,null,null,null,null,null,null,null,null,null,null,null,"Note proposée :          ",null,null,null,null,null,null,null,"/20"]
[null,null,null,null,null,null,null,null,null,null,null,null,null,null,null,null,null,null,null,null,null,null,null,null,null,null,null,null,null,null,null,null,null,null,null,"Note affectée de son coefficient :",null,null,null,null,null,null,null,"/60"]

{"sheet":"U11_E","index":13,"n_rows":32,"n_cols":49,"rows_kept":32,"cut":false,"hidden":true,"merged":[[26,0,26,45],[29,0,29,45],[30,0,31,34],[30,35,30,39],[30,40,30,42],[28,0,28,45],[30,43,30,45],[31,35,31,39],[31,40,31,42],[31,43,31,45],[20,24,20,45],[24,1,24,2],[24,3,24,45],[25,1,25,2],[25,3,25,45],[22,0,22,45],[23,1,23,2],[23,3,23,45],[20,1,20,22],[14,1,14,22],[14,24,14,45],[15,1,15,22],[15,24,15,45],[16,1,16,22],[16,24,16,45],[17,1,17,22],[17,24,17,45],[18,1,18,22],[18,24,18,45],[19,1,19,22],[19,24,19,45],[9,0,9,45],[10,0,10,45],[12,0,12,45],[13,1,13,22],[13,24,13,45],[0,0,0,45],[1,0,1,45],[2,0,2,22],[2,23,2,29],[2,30,2,45],[5,30,5,45],[5,47,6,48],[6,0,6,45],[7,0,7,45],[7,47,8,47],[7,48,8,48],[8,0,8,45],[3,0,5,22],[3,23,3,29],[3,30,4,45],[4,23,4,29],[5,23,5,29]]}
["Baccalauréat professionnel « maintenance des équipements industriels »"]
["Épreuve E11 (Unité U11) : ANALYSE ET EXPLOITATION DE DONNEES TECHNIQUES"]
["Établissement : (tampon)",null,null,null,null,null,null,null,null,null,null,null,null,null,null,null,null,null,null,null,null,null,null,"Session : "]
[null,null,null,null,null,null,null,null,null,null,null,null,null,null,null,null,null,null,null,null,null,null,null,"Nom du candidat:"]
[null,null,null,null,null,null,null,null,null,null,null,null,null,null,null,null,null,null,null,null,null,null,null,"Prénom : "]
[null,null,null,null,null,null,null,null,null,null,null,null,null,null,null,null,null,null,null,null,null,null,null,"Date de l'évaluation:",null,null,null,null,null,null,null,null,null,null,null,null,null,null,null,null,null,null,null,null,null,null,null,"Situation d'évaluation :"]
["Lieu d’évaluation :"]
["      Etablissement",null,null,null,null,null,null,null,null,null,null,null,null,null,null,null,null,null,null,null,null,null,null,null,null,null,null,null,null,null,null,null,null,null,null,null,null,null,null,null,null,null,null,null,null,null,null,"E 11","E"]
["      Entreprise :       "]
["Description sommaire du travail demandé :"]
[]
["fh"]
["Données fournies au candidat"]
["X","Le dossier technique du bien sur supports papiers ou supports numériques",null,null,null,null,null,null,null,null,null,null,null,null,null,null,null,null,null,null,null,null,null,"X","Le cahier des charges fonctionnel"]
["X","Le bien et les conditions de son environnement",null,null,null,null,null,null,null,null,null,null,null,null,null,null,null,null,null,null,null,null,null,"X","Equipement informatique"]
["X","Les normes",null,null,null,null,null,null,null,null,null,null,null,null,null,null,null,null,null,null,null,null,null,"X","Les logiciels"]
["X","Toutes documentations techniques",null,null,null,null,null,null,null,null,null,null,null,null,null,null,null,null,null,null,null,null,null,"X","Le plan de prévention"]
["X","Document unique d’évaluation des risques"]
[]
[]
[]
["     ÇRepérer les données fournies",null,null,null,null,null,null,null,null,null,null,null,null,null,null,null,null,null,null,null,null,null,null,null,"ÇRepérer les données fournies"]
["Travail demandé"]
["X","A1-T1",null,"Réaliser la maintenance corrective - Diagnostiquer les pannes."]
["X","A1-T2",null,"Réaliser la maintenance corrective - Préparer sa réparation, son dépannage. "]
["X","A1-T3",null,"Réaliser la maintenance corrective - Réaliser des réparations, des dépannages dans les domaines : mécanique, électrique, pneumatique, hydraulique."]
["Consulter le référentiel des activités professionnelles pour obtenir le détail des tâches."]
["Ç Repérer les tâches demandées (ce sont celles qui correspondent à l’unité dans le référentiel de certification, à l’exclusion de toute autre)"]
["Appréciation globale et proposition de note : "]
[]
["Noms et signatures des évaluateurs :\n\n\n",null,null,null,null,null,null,null,null,null,null,null,null,null,null,null,null,null,null,null,null,null,null,null,null,null,null,null,null,null,null,null,null,null,null,"Note proposée :          ",null,null,null,null,null,null,null,"/20"]
[null,null,null,null,null,null,null,null,null,null,null,null,null,null,null,null,null,null,null,null,null,null,null,null,null,null,null,null,null,null,null,null,null,null,null,"Note affectée de son coefficient :",null,null,null,null,null,null,null,"/60"]

{"sheet":"U11_F","index":14,"n_rows":32,"n_cols":49,"rows_kept":32,"cut":false,"hidden":true,"merged":[[26,0,26,45],[29,0,29,45],[30,0,31,34],[30,35,30,39],[30,40,30,42],[28,0,28,45],[30,43,30,45],[31,35,31,39],[31,40,31,42],[31,43,31,45],[20,24,20,45],[24,1,24,2],[24,3,24,45],[25,1,25,2],[25,3,25,45],[22,0,22,45],[23,1,23,2],[23,3,23,45],[20,1,20,22],[14,1,14,22],[14,24,14,45],[15,1,15,22],[15,24,15,45],[16,1,16,22],[16,24,16,45],[17,1,17,22],[17,24,17,45],[18,1,18,22],[18,24,18,45],[19,1,19,22],[19,24,19,45],[9,0,9,45],[10,0,10,45],[12,0,12,45],[13,1,13,22],[13,24,13,45],[0,0,0,45],[1,0,1,45],[2,0,2,22],[2,23,2,29],[2,30,2,45],[5,30,5,45],[5,47,6,48],[6,0,6,45],[7,0,7,45],[7,47,8,47],[7,48,8,48],[8,0,8,45],[3,0,5,22],[3,23,3,29],[3,30,4,45],[4,23,4,29],[5,23,5,29]]}
["Baccalauréat professionnel « maintenance des équipements industriels »"]
["Épreuve E11 (Unité U11) : ANALYSE ET EXPLOITATION DE DONNEES TECHNIQUES"]
["Établissement : (tampon)",null,null,null,null,null,null,null,null,null,null,null,null,null,null,null,null,null,null,null,null,null,null,"Session : "]
[null,null,null,null,null,null,null,null,null,null,null,null,null,null,null,null,null,null,null,null,null,null,null,"Nom du candidat:"]
[null,null,null,null,null,null,null,null,null,null,null,null,null,null,null,null,null,null,null,null,null,null,null,"Prénom : "]
[null,null,null,null,null,null,null,null,null,null,null,null,null,null,null,null,null,null,null,null,null,null,null,"Date de l'évaluation:",null,null,null,null,null,null,null,null,null,null,null,null,null,null,null,null,null,null,null,null,null,null,null,"Situation d'évaluation :"]
["Lieu d’évaluation :"]
["      Etablissement",null,null,null,null,null,null,null,null,null,null,null,null,null,null,null,null,null,null,null,null,null,null,null,null,null,null,null,null,null,null,null,null,null,null,null,null,null,null,null,null,null,null,null,null,null,null,"E 11","F"]
["      Entreprise :       "]
["Description sommaire du travail demandé :"]
[]
["fh"]
["Données fournies au candidat"]
["X","Le dossier technique du bien sur supports papiers ou supports numériques",null,null,null,null,null,null,null,null,null,null,null,null,null,null,null,null,null,null,null,null,null,"X","Le cahier des charges fonctionnel"]
["X","Le bien et les conditions de son environnement",null,null,null,null,null,null,null,null,null,null,null,null,null,null,null,null,null,null,null,null,null,"X","Equipement informatique"]
["X","Les normes",null,null,null,null,null,null,null,null,null,null,null,null,null,null,null,null,null,null,null,null,null,"X","Les logiciels"]
["X","Toutes documentations techniques",null,null,null,null,null,null,null,null,null,null,null,null,null,null,null,null,null,null,null,null,null,"X","Le plan de prévention"]
["X","Document unique d’évaluation des risques"]
[]
[]
[]
["     ÇRepérer les données fournies",null,null,null,null,null,null,null,null,null,null,null,null,null,null,null,null,null,null,null,null,null,null,null,"ÇRepérer les données fournies"]
["Travail demandé"]
["X","A1-T1",null,"Réaliser la maintenance corrective - Diagnostiquer les pannes."]
["X","A1-T2",null,"Réaliser la maintenance corrective - Préparer sa réparation, son dépannage. "]
["X","A1-T3",null,"Réaliser la maintenance corrective - Réaliser des réparations, des dépannages dans les domaines : mécanique, électrique, pneumatique, hydraulique."]
["Consulter le référentiel des activités professionnelles pour obtenir le détail des tâches."]
["Ç Repérer les tâches demandées (ce sont celles qui correspondent à l’unité dans le référentiel de certification, à l’exclusion de toute autre)"]
["Appréciation globale et proposition de note : "]
[]
["Noms et signatures des évaluateurs :\n\n\n",null,null,null,null,null,null,null,null,null,null,null,null,null,null,null,null,null,null,null,null,null,null,null,null,null,null,null,null,null,null,null,null,null,null,"Note proposée :          ",null,null,null,null,null,null,null,"/20"]
[null,null,null,null,null,null,null,null,null,null,null,null,null,null,null,null,null,null,null,null,null,null,null,null,null,null,null,null,null,null,null,null,null,null,null,"Note affectée de son coefficient :",null,null,null,null,null,null,null,"/60"]

{"sheet":"U11_G","index":15,"n_rows":32,"n_cols":49,"rows_kept":32,"cut":false,"hidden":true,"merged":[[26,0,26,45],[29,0,29,45],[30,0,31,34],[30,35,30,39],[30,40,30,42],[28,0,28,45],[30,43,30,45],[31,35,31,39],[31,40,31,42],[31,43,31,45],[20,24,20,45],[24,1,24,2],[24,3,24,45],[25,1,25,2],[25,3,25,45],[22,0,22,45],[23,1,23,2],[23,3,23,45],[20,1,20,22],[14,1,14,22],[14,24,14,45],[15,1,15,22],[15,24,15,45],[16,1,16,22],[16,24,16,45],[17,1,17,22],[17,24,17,45],[18,1,18,22],[18,24,18,45],[19,1,19,22],[19,24,19,45],[9,0,9,45],[10,0,10,45],[12,0,12,45],[13,1,13,22],[13,24,13,45],[0,0,0,45],[1,0,1,45],[2,0,2,22],[2,23,2,29],[2,30,2,45],[5,30,5,45],[5,47,6,48],[6,0,6,45],[7,0,7,45],[7,47,8,47],[7,48,8,48],[8,0,8,45],[3,0,5,22],[3,23,3,29],[3,30,4,45],[4,23,4,29],[5,23,5,29]]}
["Baccalauréat professionnel « maintenance des équipements industriels »"]
["Épreuve E11 (Unité U11) : ANALYSE ET EXPLOITATION DE DONNEES TECHNIQUES"]
["Établissement : (tampon)",null,null,null,null,null,null,null,null,null,null,null,null,null,null,null,null,null,null,null,null,null,null,"Session : "]
[null,null,null,null,null,null,null,null,null,null,null,null,null,null,null,null,null,null,null,null,null,null,null,"Nom du candidat:"]
[null,null,null,null,null,null,null,null,null,null,null,null,null,null,null,null,null,null,null,null,null,null,null,"Prénom : "]
[null,null,null,null,null,null,null,null,null,null,null,null,null,null,null,null,null,null,null,null,null,null,null,"Date de l'évaluation:",null,null,null,null,null,null,null,null,null,null,null,null,null,null,null,null,null,null,null,null,null,null,null,"Situation d'évaluation :"]
["Lieu d’évaluation :"]
["      Etablissement",null,null,null,null,null,null,null,null,null,null,null,null,null,null,null,null,null,null,null,null,null,null,null,null,null,null,null,null,null,null,null,null,null,null,null,null,null,null,null,null,null,null,null,null,null,null,"E 11","G"]
["      Entreprise :       "]
["Description sommaire du travail demandé :"]
[]
["fh"]
["Données fournies au candidat"]
["X","Le dossier technique du bien sur supports papiers ou supports numériques",null,null,null,null,null,null,null,null,null,null,null,null,null,null,null,null,null,null,null,null,null,"X","Le cahier des charges fonctionnel"]
["X","Le bien et les conditions de son environnement",null,null,null,null,null,null,null,null,null,null,null,null,null,null,null,null,null,null,null,null,null,"X","Equipement informatique"]
["X","Les normes",null,null,null,null,null,null,null,null,null,null,null,null,null,null,null,null,null,null,null,null,null,"X","Les logiciels"]
["X","Toutes documentations techniques",null,null,null,null,null,null,null,null,null,null,null,null,null,null,null,null,null,null,null,null,null,"X","Le plan de prévention"]
["X","Document unique d’évaluation des risques"]
[]
[]
[]
["     ÇRepérer les données fournies",null,null,null,null,null,null,null,null,null,null,null,null,null,null,null,null,null,null,null,null,null,null,null,"ÇRepérer les données fournies"]
["Travail demandé"]
["X","A1-T1",null,"Réaliser la maintenance corrective - Diagnostiquer les pannes."]
["X","A1-T2",null,"Réaliser la maintenance corrective - Préparer sa réparation, son dépannage. "]
["X","A1-T3",null,"Réaliser la maintenance corrective - Réaliser des réparations, des dépannages dans les domaines : mécanique, électrique, pneumatique, hydraulique."]
["Consulter le référentiel des activités professionnelles pour obtenir le détail des tâches."]
["Ç Repérer les tâches demandées (ce sont celles qui correspondent à l’unité dans le référentiel de certification, à l’exclusion de toute autre)"]
["Appréciation globale et proposition de note : "]
[]
["Noms et signatures des évaluateurs :\n\n\n",null,null,null,null,null,null,null,null,null,null,null,null,null,null,null,null,null,null,null,null,null,null,null,null,null,null,null,null,null,null,null,null,null,null,"Note proposée :          ",null,null,null,null,null,null,null,"/20"]
[null,null,null,null,null,null,null,null,null,null,null,null,null,null,null,null,null,null,null,null,null,null,null,null,null,null,null,null,null,null,null,null,null,null,null,"Note affectée de son coefficient :",null,null,null,null,null,null,null,"/60"]

{"sheet":"U11_H","index":16,"n_rows":32,"n_cols":49,"rows_kept":32,"cut":false,"hidden":true,"merged":[[26,0,26,45],[29,0,29,45],[30,0,31,34],[30,35,30,39],[30,40,30,42],[28,0,28,45],[30,43,30,45],[31,35,31,39],[31,40,31,42],[31,43,31,45],[20,24,20,45],[24,1,24,2],[24,3,24,45],[25,1,25,2],[25,3,25,45],[22,0,22,45],[23,1,23,2],[23,3,23,45],[20,1,20,22],[14,1,14,22],[14,24,14,45],[15,1,15,22],[15,24,15,45],[16,1,16,22],[16,24,16,45],[17,1,17,22],[17,24,17,45],[18,1,18,22],[18,24,18,45],[19,1,19,22],[19,24,19,45],[9,0,9,45],[10,0,10,45],[12,0,12,45],[13,1,13,22],[13,24,13,45],[0,0,0,45],[1,0,1,45],[2,0,2,22],[2,23,2,29],[2,30,2,45],[5,30,5,45],[5,47,6,48],[6,0,6,45],[7,0,7,45],[7,47,8,47],[7,48,8,48],[8,0,8,45],[3,0,5,22],[3,23,3,29],[3,30,4,45],[4,23,4,29],[5,23,5,29]]}
["Baccalauréat professionnel « maintenance des équipements industriels »"]
["Épreuve E11 (Unité U11) : ANALYSE ET EXPLOITATION DE DONNEES TECHNIQUES"]
["Établissement : (tampon)",null,null,null,null,null,null,null,null,null,null,null,null,null,null,null,null,null,null,null,null,null,null,"Session : "]
[null,null,null,null,null,null,null,null,null,null,null,null,null,null,null,null,null,null,null,null,null,null,null,"Nom du candidat:"]
[null,null,null,null,null,null,null,null,null,null,null,null,null,null,null,null,null,null,null,null,null,null,null,"Prénom : "]
[null,null,null,null,null,null,null,null,null,null,null,null,null,null,null,null,null,null,null,null,null,null,null,"Date de l'évaluation:",null,null,null,null,null,null,null,null,null,null,null,null,null,null,null,null,null,null,null,null,null,null,null,"Situation d'évaluation :"]
["Lieu d’évaluation :"]
["      Etablissement",null,null,null,null,null,null,null,null,null,null,null,null,null,null,null,null,null,null,null,null,null,null,null,null,null,null,null,null,null,null,null,null,null,null,null,null,null,null,null,null,null,null,null,null,null,null,"E 11","H"]
["      Entreprise :       "]
["Description sommaire du travail demandé :"]
[]
["fh"]
["Données fournies au candidat"]
["X","Le dossier technique du bien sur supports papiers ou supports numériques",null,null,null,null,null,null,null,null,null,null,null,null,null,null,null,null,null,null,null,null,null,"X","Le cahier des charges fonctionnel"]
["X","Le bien et les conditions de son environnement",null,null,null,null,null,null,null,null,null,null,null,null,null,null,null,null,null,null,null,null,null,"X","Equipement informatique"]
["X","Les normes",null,null,null,null,null,null,null,null,null,null,null,null,null,null,null,null,null,null,null,null,null,"X","Les logiciels"]
["X","Toutes documentations techniques",null,null,null,null,null,null,null,null,null,null,null,null,null,null,null,null,null,null,null,null,null,"X","Le plan de prévention"]
["X","Document unique d’évaluation des risques"]
[]
[]
[]
["     ÇRepérer les données fournies",null,null,null,null,null,null,null,null,null,null,null,null,null,null,null,null,null,null,null,null,null,null,null,"ÇRepérer les données fournies"]
["Travail demandé"]
["X","A1-T1",null,"Réaliser la maintenance corrective - Diagnostiquer les pannes."]
["X","A1-T2",null,"Réaliser la maintenance corrective - Préparer sa réparation, son dépannage. "]
["X","A1-T3",null,"Réaliser la maintenance corrective - Réaliser des réparations, des dépannages dans les domaines : mécanique, électrique, pneumatique, hydraulique."]
["Consulter le référentiel des activités professionnelles pour obtenir le détail des tâches."]
["Ç Repérer les tâches demandées (ce sont celles qui correspondent à l’unité dans le référentiel de certification, à l’exclusion de toute autre)"]
["Appréciation globale et proposition de note : "]
[]
["Noms et signatures des évaluateurs :\n\n\n",null,null,null,null,null,null,null,null,null,null,null,null,null,null,null,null,null,null,null,null,null,null,null,null,null,null,null,null,null,null,null,null,null,null,"Note proposée :          ",null,null,null,null,null,null,null,"/20"]
[null,null,null,null,null,null,null,null,null,null,null,null,null,null,null,null,null,null,null,null,null,null,null,null,null,null,null,null,null,null,null,null,null,null,null,"Note affectée de son coefficient :",null,null,null,null,null,null,null,"/60"]

{"sheet":"U2_A","index":17,"n_rows":36,"n_cols":49,"rows_kept":36,"cut":false,"hidden":true,"merged":[[5,47,6,48],[7,47,8,47],[7,48,8,48],[3,0,5,22],[3,23,3,29],[3,30,4,45],[4,23,4,29],[5,23,5,29],[17,1,17,22],[17,24,17,45],[0,0,0,45],[1,0,1,45],[2,0,2,22],[2,23,2,29],[2,30,2,45],[5,30,5,45],[6,0,6,45],[7,0,7,45],[8,0,8,45],[9,0,9,45],[10,0,10,45],[12,0,12,45],[13,1,13,22],[13,24,13,45],[14,1,14,22],[14,24,14,45],[21,1,21,22],[21,24,21,45],[22,1,22,22],[22,24,22,45],[18,1,18,22],[18,24,18,45],[19,1,19,22],[19,24,19,45],[20,1,20,22],[20,24,20,45],[15,1,15,22],[15,24,15,45],[16,1,16,22],[16,24,16,45],[24,0,24,45],[25,1,25,2],[25,3,25,45],[28,1,28,2],[29,1,29,2],[26,1,26,2],[27,1,27,2],[26,3,26,45],[27,3,27,45],[28,3,28,45],[29,3,29,45],[30,0,30,45],[32,0,32,45],[33,0,33,45],[34,0,35,34],[34,35,34,39],[34,40,34,42],[34,43,34,45],[35,35,35,39],[35,40,35,42],[35,43,35,45]]}
["Baccalauréat professionnel « maintenance des équipements industriels »"]
["Épreuve E2 (Unité U2) : ANALYSE ETPREPARATION D’UNE ACTIVITE DE MAINTENANCE"]
["Établissement : (tampon)",null,null,null,null,null,null,null,null,null,null,null,null,null,null,null,null,null,null,null,null,null,null,"Session : "]
[null,null,null,null,null,null,null,null,null,null,null,null,null,null,null,null,null,null,null,null,null,null,null,"Nom du candidat:"]
[null,null,null,null,null,null,null,null,null,null,null,null,null,null,null,null,null,null,null,null,null,null,null,"Prénom : "]
[null,null,null,null,null,null,null,null,null,null,null,null,null,null,null,null,null,null,null,null,null,null,null,"Date de l'évaluation:",null,null,null,null,null,null,null,null,null,null,null,null,null,null,null,null,null,null,null,null,null,null,null,"Situation d'évaluation :"]
["Lieu d’évaluation :"]
["      Etablissement",null,null,null,null,null,null,null,null,null,null,null,null,null,null,null,null,null,null,null,null,null,null,null,null,null,null,null,null,null,null,null,null,null,null,null,null,null,null,null,null,null,null,null,null,null,null,"E 2","A"]
["      Entreprise :       "]
["Description sommaire du travail demandé :"]
[]
[]
["Données et condition de réalisation."]
["X","Le dossier technique du bien sur supports papiers ou supports numériques",null,null,null,null,null,null,null,null,null,null,null,null,null,null,null,null,null,null,null,null,null,"X","Le cahier des charges fonctionnel"]
["X","Le bien et les conditions de son environnement",null,null,null,null,null,null,null,null,null,null,null,null,null,null,null,null,null,null,null,null,null,"X","L’équipement informatique"]
["X","Les normes",null,null,null,null,null,null,null,null,null,null,null,null,null,null,null,null,null,null,null,null,null,"X","Les logiciels"]
["X","Toutes documentations techniques",null,null,null,null,null,null,null,null,null,null,null,null,null,null,null,null,null,null,null,null,null,"X","Le plan de prévention"]
["X","Le document unique d’évaluation des risques",null,null,null,null,null,null,null,null,null,null,null,null,null,null,null,null,null,null,null,null,null,"X","Les outils descripteurs (grafcet, chronogramme…)"]
["X","Toutes informations en provenance de l’utilisateur",null,null,null,null,null,null,null,null,null,null,null,null,null,null,null,null,null,null,null,null,null,"X","Le constat de défaillance."]
["X","Les contraintes dans l’environnement",null,null,null,null,null,null,null,null,null,null,null,null,null,null,null,null,null,null,null,null,null,"X","Les impératifs de production."]
["X","Les délais d’interventions",null,null,null,null,null,null,null,null,null,null,null,null,null,null,null,null,null,null,null,null,null,"X","Toutes documentations techniques"]
["X","Un groupe de travail.",null,null,null,null,null,null,null,null,null,null,null,null,null,null,null,null,null,null,null,null,null,"X","Les moyens de communication"]
["X","La fiche de procédures",null,null,null,null,null,null,null,null,null,null,null,null,null,null,null,null,null,null,null,null,null,"X","La demande d’intervention ou le bon de travail."]
["     ÇRepérer les données fournies",null,null,null,null,null,null,null,null,null,null,null,null,null,null,null,null,null,null,null,null,null,null,null,"ÇRepérer les données fournies"]
["Travail demandé"]
["X","A1-T1",null,"Réaliser la maintenance corrective - Diagnostiquer les pannes."]
["X","A1-T2",null,"Réaliser la maintenance corrective - Préparer sa réparation, son dépannage. "]
["X","A1-T3",null,"Réaliser la maintenance corrective - Réaliser des réparations, des dépannages dans les domaines : mécanique, électrique, pneumatique, hydraulique."]
["X","A3-T1",null,"Mettre en œuvre des améliorations, des modifications - Proposer des améliorations ou des modifications"]
["X","A3-T2",null,"Mettre en œuvre des améliorations, des modifications - Préparer et réaliser l’amélioration ou la modification"]
["Consulter le référentiel des activités professionnelles pour obtenir le détail des tâches."]
["Ç Repérer les tâches demandées (ce sont celles qui correspondent à l’unité dans le référentiel de certification, à l’exclusion de toute autre)"]
["Appréciation globale et proposition de note : "]
[]
["Noms et signatures des évaluateurs :\n\n\n",null,null,null,null,null,null,null,null,null,null,null,null,null,null,null,null,null,null,null,null,null,null,null,null,null,null,null,null,null,null,null,null,null,null,"Note proposée :          ",null,null,null,null,null,null,null,"/20"]
[null,null,null,null,null,null,null,null,null,null,null,null,null,null,null,null,null,null,null,null,null,null,null,null,null,null,null,null,null,null,null,null,null,null,null,"Note affectée de son coefficient :",null,null,null,null,null,null,null,"/80"]

{"sheet":"U2_B","index":18,"n_rows":36,"n_cols":49,"rows_kept":36,"cut":false,"hidden":true,"merged":[[5,47,6,48],[6,0,6,45],[7,0,7,45],[7,47,8,47],[7,48,8,48],[8,0,8,45],[3,0,5,22],[3,23,3,29],[3,30,4,45],[4,23,4,29],[5,23,5,29],[17,1,17,22],[17,24,17,45],[0,0,0,45],[1,0,1,45],[2,0,2,22],[2,23,2,29],[2,30,2,45],[5,30,5,45],[9,0,9,45],[10,0,10,45],[12,0,12,45],[13,1,13,22],[13,24,13,45],[14,1,14,22],[14,24,14,45],[15,1,15,22],[18,1,18,22],[18,24,18,45],[19,1,19,22],[19,24,19,45],[20,1,20,22],[20,24,20,45],[15,24,15,45],[16,1,16,22],[16,24,16,45],[28,1,28,2],[24,0,24,45],[25,1,25,2],[25,3,25,45],[26,1,26,2],[26,3,26,45],[27,1,27,2],[27,3,27,45],[28,3,28,45],[21,1,21,22],[21,24,21,45],[22,1,22,22],[22,24,22,45],[29,1,29,2],[29,3,29,45],[30,0,30,45],[32,0,32,45],[33,0,33,45],[34,0,35,34],[34,35,34,39],[34,40,34,42],[34,43,34,45],[35,35,35,39],[35,40,35,42],[35,43,35,45]]}
["Baccalauréat professionnel « maintenance des équipements industriels »"]
["Épreuve E2 (Unité U2) : ANALYSE ETPREPARATION D’UNE ACTIVITE DE MAINTENANCE"]
["Établissement : (tampon)",null,null,null,null,null,null,null,null,null,null,null,null,null,null,null,null,null,null,null,null,null,null,"Session : "]
[null,null,null,null,null,null,null,null,null,null,null,null,null,null,null,null,null,null,null,null,null,null,null,"Nom du candidat:"]
[null,null,null,null,null,null,null,null,null,null,null,null,null,null,null,null,null,null,null,null,null,null,null,"Prénom : "]
[null,null,null,null,null,null,null,null,null,null,null,null,null,null,null,null,null,null,null,null,null,null,null,"Date de l'évaluation:",null,null,null,null,null,null,null,null,null,null,null,null,null,null,null,null,null,null,null,null,null,null,null,"Situation d'évaluation :"]
["Lieu d’évaluation :"]
["      Etablissement",null,null,null,null,null,null,null,null,null,null,null,null,null,null,null,null,null,null,null,null,null,null,null,null,null,null,null,null,null,null,null,null,null,null,null,null,null,null,null,null,null,null,null,null,null,null,"E 2","B"]
["      Entreprise :       "]
["Description sommaire du travail demandé :"]
[]
[]
["Données et condition de réalisation."]
["X","Le dossier technique du bien sur supports papiers ou supports numériques",null,null,null,null,null,null,null,null,null,null,null,null,null,null,null,null,null,null,null,null,null,"X","Le cahier des charges fonctionnel"]
["X","Le bien et les conditions de son environnement",null,null,null,null,null,null,null,null,null,null,null,null,null,null,null,null,null,null,null,null,null,"X","L’équipement informatique"]
["X","Les normes",null,null,null,null,null,null,null,null,null,null,null,null,null,null,null,null,null,null,null,null,null,"X","Les logiciels"]
["X","Toutes documentations techniques",null,null,null,null,null,null,null,null,null,null,null,null,null,null,null,null,null,null,null,null,null,"X","Le plan de prévention"]
["X","Le document unique d’évaluation des risques",null,null,null,null,null,null,null,null,null,null,null,null,null,null,null,null,null,null,null,null,null,"X","Les outils descripteurs (grafcet, chronogramme…)"]
["X","Toutes informations en provenance de l’utilisateur",null,null,null,null,null,null,null,null,null,null,null,null,null,null,null,null,null,null,null,null,null,"X","Le constat de défaillance."]
["X","Les contraintes dans l’environnement",null,null,null,null,null,null,null,null,null,null,null,null,null,null,null,null,null,null,null,null,null,"X","Les impératifs de production."]
["X","Les délais d’interventions",null,null,null,null,null,null,null,null,null,null,null,null,null,null,null,null,null,null,null,null,null,"X","Toutes documentations techniques"]
["X","Un groupe de travail.",null,null,null,null,null,null,null,null,null,null,null,null,null,null,null,null,null,null,null,null,null,"X","Les moyens de communication"]
["X","La fiche de procédures",null,null,null,null,null,null,null,null,null,null,null,null,null,null,null,null,null,null,null,null,null,"X","La demande d’intervention ou le bon de travail."]
["     ÇRepérer les données fournies",null,null,null,null,null,null,null,null,null,null,null,null,null,null,null,null,null,null,null,null,null,null,null,"ÇRepérer les données fournies"]
["Travail demandé"]
["X","A1-T1",null,"Réaliser la maintenance corrective - Diagnostiquer les pannes."]
["X","A1-T2",null,"Réaliser la maintenance corrective - Préparer sa réparation, son dépannage. "]
["X","A1-T3",null,"Réaliser la maintenance corrective - Réaliser des réparations, des dépannages dans les domaines : mécanique, électrique, pneumatique, hydraulique."]
["X","A3-T1",null,"Mettre en œuvre des améliorations, des modifications - Proposer des améliorations ou des modifications"]
["X","A3-T2",null,"Mettre en œuvre des améliorations, des modifications - Préparer et réaliser l’amélioration ou la modification"]
["Consulter le référentiel des activités professionnelles pour obtenir le détail des tâches."]
["Ç Repérer les tâches demandées (ce sont celles qui correspondent à l’unité dans le référentiel de certification, à l’exclusion de toute autre)"]
["Appréciation globale et proposition de note : "]
[]
["Noms et signatures des évaluateurs :\n\n\n",null,null,null,null,null,null,null,null,null,null,null,null,null,null,null,null,null,null,null,null,null,null,null,null,null,null,null,null,null,null,null,null,null,null,"Note proposée :          ",null,null,null,null,null,null,null,"/20"]
[null,null,null,null,null,null,null,null,null,null,null,null,null,null,null,null,null,null,null,null,null,null,null,null,null,null,null,null,null,null,null,null,null,null,null,"Note affectée de son coefficient :",null,null,null,null,null,null,null,"/80"]

{"sheet":"U2_C","index":19,"n_rows":36,"n_cols":49,"rows_kept":36,"cut":false,"hidden":true,"merged":[[5,47,6,48],[6,0,6,45],[7,0,7,45],[7,47,8,47],[7,48,8,48],[8,0,8,45],[3,0,5,22],[3,23,3,29],[3,30,4,45],[4,23,4,29],[5,23,5,29],[17,1,17,22],[17,24,17,45],[0,0,0,45],[1,0,1,45],[2,0,2,22],[2,23,2,29],[2,30,2,45],[5,30,5,45],[9,0,9,45],[10,0,10,45],[12,0,12,45],[13,1,13,22],[13,24,13,45],[14,1,14,22],[14,24,14,45],[15,1,15,22],[18,1,18,22],[18,24,18,45],[19,1,19,22],[19,24,19,45],[20,1,20,22],[20,24,20,45],[15,24,15,45],[16,1,16,22],[16,24,16,45],[28,1,28,2],[24,0,24,45],[25,1,25,2],[25,3,25,45],[26,1,26,2],[26,3,26,45],[27,1,27,2],[27,3,27,45],[28,3,28,45],[21,1,21,22],[21,24,21,45],[22,1,22,22],[22,24,22,45],[29,1,29,2],[29,3,29,45],[30,0,30,45],[32,0,32,45],[33,0,33,45],[34,0,35,34],[34,35,34,39],[34,40,34,42],[34,43,34,45],[35,35,35,39],[35,40,35,42],[35,43,35,45]]}
["Baccalauréat professionnel « maintenance des équipements industriels »"]
["Épreuve E2 (Unité U2) : ANALYSE ETPREPARATION D’UNE ACTIVITE DE MAINTENANCE"]
["Établissement : (tampon)",null,null,null,null,null,null,null,null,null,null,null,null,null,null,null,null,null,null,null,null,null,null,"Session : "]
[null,null,null,null,null,null,null,null,null,null,null,null,null,null,null,null,null,null,null,null,null,null,null,"Nom du candidat:"]
[null,null,null,null,null,null,null,null,null,null,null,null,null,null,null,null,null,null,null,null,null,null,null,"Prénom : "]
[null,null,null,null,null,null,null,null,null,null,null,null,null,null,null,null,null,null,null,null,null,null,null,"Date de l'évaluation:",null,null,null,null,null,null,null,null,null,null,null,null,null,null,null,null,null,null,null,null,null,null,null,"Situation d'évaluation :"]
["Lieu d’évaluation :"]
["      Etablissement",null,null,null,null,null,null,null,null,null,null,null,null,null,null,null,null,null,null,null,null,null,null,null,null,null,null,null,null,null,null,null,null,null,null,null,null,null,null,null,null,null,null,null,null,null,null,"E 2","C"]
["      Entreprise :       "]
["Description sommaire du travail demandé :"]
[]
[]
["Données et condition de réalisation."]
["X","Le dossier technique du bien sur supports papiers ou supports numériques",null,null,null,null,null,null,null,null,null,null,null,null,null,null,null,null,null,null,null,null,null,"X","Le cahier des charges fonctionnel"]
["X","Le bien et les conditions de son environnement",null,null,null,null,null,null,null,null,null,null,null,null,null,null,null,null,null,null,null,null,null,"X","L’équipement informatique"]
["X","Les normes",null,null,null,null,null,null,null,null,null,null,null,null,null,null,null,null,null,null,null,null,null,"X","Les logiciels"]
["X","Toutes documentations techniques",null,null,null,null,null,null,null,null,null,null,null,null,null,null,null,null,null,null,null,null,null,"X","Le plan de prévention"]
["X","Le document unique d’évaluation des risques",null,null,null,null,null,null,null,null,null,null,null,null,null,null,null,null,null,null,null,null,null,"X","Les outils descripteurs (grafcet, chronogramme…)"]
["X","Toutes informations en provenance de l’utilisateur",null,null,null,null,null,null,null,null,null,null,null,null,null,null,null,null,null,null,null,null,null,"X","Le constat de défaillance."]
["X","Les contraintes dans l’environnement",null,null,null,null,null,null,null,null,null,null,null,null,null,null,null,null,null,null,null,null,null,"X","Les impératifs de production."]
["X","Les délais d’interventions",null,null,null,null,null,null,null,null,null,null,null,null,null,null,null,null,null,null,null,null,null,"X","Toutes documentations techniques"]
["X","Un groupe de travail.",null,null,null,null,null,null,null,null,null,null,null,null,null,null,null,null,null,null,null,null,null,"X","Les moyens de communication"]
["X","La fiche de procédures",null,null,null,null,null,null,null,null,null,null,null,null,null,null,null,null,null,null,null,null,null,"X","La demande d’intervention ou le bon de travail."]
["     ÇRepérer les données fournies",null,null,null,null,null,null,null,null,null,null,null,null,null,null,null,null,null,null,null,null,null,null,null,"ÇRepérer les données fournies"]
["Travail demandé"]
["X","A1-T1",null,"Réaliser la maintenance corrective - Diagnostiquer les pannes."]
["X","A1-T2",null,"Réaliser la maintenance corrective - Préparer sa réparation, son dépannage. "]
["X","A1-T3",null,"Réaliser la maintenance corrective - Réaliser des réparations, des dépannages dans les domaines : mécanique, électrique, pneumatique, hydraulique."]
["X","A3-T1",null,"Mettre en œuvre des améliorations, des modifications - Proposer des améliorations ou des modifications"]
["X","A3-T2",null,"Mettre en œuvre des améliorations, des modifications - Préparer et réaliser l’amélioration ou la modification"]
["Consulter le référentiel des activités professionnelles pour obtenir le détail des tâches."]
["Ç Repérer les tâches demandées (ce sont celles qui correspondent à l’unité dans le référentiel de certification, à l’exclusion de toute autre)"]
["Appréciation globale et proposition de note : "]
[]
["Noms et signatures des évaluateurs :\n\n\n",null,null,null,null,null,null,null,null,null,null,null,null,null,null,null,null,null,null,null,null,null,null,null,null,null,null,null,null,null,null,null,null,null,null,"Note proposée :          ",null,null,null,null,null,null,null,"/20"]
[null,null,null,null,null,null,null,null,null,null,null,null,null,null,null,null,null,null,null,null,null,null,null,null,null,null,null,null,null,null,null,null,null,null,null,"Note affectée de son coefficient :",null,null,null,null,null,null,null,"/80"]

{"sheet":"U2_D","index":20,"n_rows":36,"n_cols":49,"rows_kept":36,"cut":false,"hidden":true,"merged":[[5,47,6,48],[6,0,6,45],[7,0,7,45],[7,47,8,47],[7,48,8,48],[8,0,8,45],[3,0,5,22],[3,23,3,29],[3,30,4,45],[4,23,4,29],[5,23,5,29],[17,1,17,22],[17,24,17,45],[0,0,0,45],[1,0,1,45],[2,0,2,22],[2,23,2,29],[2,30,2,45],[5,30,5,45],[9,0,9,45],[10,0,10,45],[12,0,12,45],[13,1,13,22],[13,24,13,45],[14,1,14,22],[14,24,14,45],[15,1,15,22],[18,1,18,22],[18,24,18,45],[19,1,19,22],[19,24,19,45],[20,1,20,22],[20,24,20,45],[15,24,15,45],[16,1,16,22],[16,24,16,45],[28,1,28,2],[24,0,24,45],[25,1,25,2],[25,3,25,45],[26,1,26,2],[26,3,26,45],[27,1,27,2],[27,3,27,45],[28,3,28,45],[21,1,21,22],[21,24,21,45],[22,1,22,22],[22,24,22,45],[29,1,29,2],[29,3,29,45],[30,0,30,45],[32,0,32,45],[33,0,33,45],[34,0,35,34],[34,35,34,39],[34,40,34,42],[34,43,34,45],[35,35,35,39],[35,40,35,42],[35,43,35,45]]}
["Baccalauréat professionnel « maintenance des équipements industriels »"]
["Épreuve E2 (Unité U2) : ANALYSE ETPREPARATION D’UNE ACTIVITE DE MAINTENANCE"]
["Établissement : (tampon)",null,null,null,null,null,null,null,null,null,null,null,null,null,null,null,null,null,null,null,null,null,null,"Session : "]
[null,null,null,null,null,null,null,null,null,null,null,null,null,null,null,null,null,null,null,null,null,null,null,"Nom du candidat:"]
[null,null,null,null,null,null,null,null,null,null,null,null,null,null,null,null,null,null,null,null,null,null,null,"Prénom : "]
[null,null,null,null,null,null,null,null,null,null,null,null,null,null,null,null,null,null,null,null,null,null,null,"Date de l'évaluation:",null,null,null,null,null,null,null,null,null,null,null,null,null,null,null,null,null,null,null,null,null,null,null,"Situation d'évaluation :"]
["Lieu d’évaluation :"]
["      Etablissement",null,null,null,null,null,null,null,null,null,null,null,null,null,null,null,null,null,null,null,null,null,null,null,null,null,null,null,null,null,null,null,null,null,null,null,null,null,null,null,null,null,null,null,null,null,null,"E 2","D"]
["      Entreprise :       "]
["Description sommaire du travail demandé :"]
[]
[]
["Données et condition de réalisation."]
["X","Le dossier technique du bien sur supports papiers ou supports numériques",null,null,null,null,null,null,null,null,null,null,null,null,null,null,null,null,null,null,null,null,null,"X","Le cahier des charges fonctionnel"]
["X","Le bien et les conditions de son environnement",null,null,null,null,null,null,null,null,null,null,null,null,null,null,null,null,null,null,null,null,null,"X","L’équipement informatique"]
["X","Les normes",null,null,null,null,null,null,null,null,null,null,null,null,null,null,null,null,null,null,null,null,null,"X","Les logiciels"]
["X","Toutes documentations techniques",null,null,null,null,null,null,null,null,null,null,null,null,null,null,null,null,null,null,null,null,null,"X","Le plan de prévention"]
["X","Le document unique d’évaluation des risques",null,null,null,null,null,null,null,null,null,null,null,null,null,null,null,null,null,null,null,null,null,"X","Les outils descripteurs (grafcet, chronogramme…)"]
["X","Toutes informations en provenance de l’utilisateur",null,null,null,null,null,null,null,null,null,null,null,null,null,null,null,null,null,null,null,null,null,"X","Le constat de défaillance."]
["X","Les contraintes dans l’environnement",null,null,null,null,null,null,null,null,null,null,null,null,null,null,null,null,null,null,null,null,null,"X","Les impératifs de production."]
["X","Les délais d’interventions",null,null,null,null,null,null,null,null,null,null,null,null,null,null,null,null,null,null,null,null,null,"X","Toutes documentations techniques"]
["X","Un groupe de travail.",null,null,null,null,null,null,null,null,null,null,null,null,null,null,null,null,null,null,null,null,null,"X","Les moyens de communication"]
["X","La fiche de procédures",null,null,null,null,null,null,null,null,null,null,null,null,null,null,null,null,null,null,null,null,null,"X","La demande d’intervention ou le bon de travail."]
["     ÇRepérer les données fournies",null,null,null,null,null,null,null,null,null,null,null,null,null,null,null,null,null,null,null,null,null,null,null,"ÇRepérer les données fournies"]
["Travail demandé"]
["X","A1-T1",null,"Réaliser la maintenance corrective - Diagnostiquer les pannes."]
["X","A1-T2",null,"Réaliser la maintenance corrective - Préparer sa réparation, son dépannage. "]
["X","A1-T3",null,"Réaliser la maintenance corrective - Réaliser des réparations, des dépannages dans les domaines : mécanique, électrique, pneumatique, hydraulique."]
["X","A3-T1",null,"Mettre en œuvre des améliorations, des modifications - Proposer des améliorations ou des modifications"]
["X","A3-T2",null,"Mettre en œuvre des améliorations, des modifications - Préparer et réaliser l’amélioration ou la modification"]
["Consulter le référentiel des activités professionnelles pour obtenir le détail des tâches."]
["Ç Repérer les tâches demandées (ce sont celles qui correspondent à l’unité dans le référentiel de certification, à l’exclusion de toute autre)"]
["Appréciation globale et proposition de note : "]
[]
["Noms et signatures des évaluateurs :\n\n\n",null,null,null,null,null,null,null,null,null,null,null,null,null,null,null,null,null,null,null,null,null,null,null,null,null,null,null,null,null,null,null,null,null,null,"Note proposée :          ",null,null,null,null,null,null,null,"/20"]
[null,null,null,null,null,null,null,null,null,null,null,null,null,null,null,null,null,null,null,null,null,null,null,null,null,null,null,null,null,null,null,null,null,null,null,"Note affectée de son coefficient :",null,null,null,null,null,null,null,"/80"]

{"sheet":"U2_E","index":21,"n_rows":36,"n_cols":49,"rows_kept":36,"cut":false,"hidden":true,"merged":[[5,47,6,48],[6,0,6,45],[7,0,7,45],[7,47,8,47],[7,48,8,48],[8,0,8,45],[3,0,5,22],[3,23,3,29],[3,30,4,45],[4,23,4,29],[5,23,5,29],[17,1,17,22],[17,24,17,45],[0,0,0,45],[1,0,1,45],[2,0,2,22],[2,23,2,29],[2,30,2,45],[5,30,5,45],[9,0,9,45],[10,0,10,45],[12,0,12,45],[13,1,13,22],[13,24,13,45],[14,1,14,22],[14,24,14,45],[15,1,15,22],[18,1,18,22],[18,24,18,45],[19,1,19,22],[19,24,19,45],[20,1,20,22],[20,24,20,45],[15,24,15,45],[16,1,16,22],[16,24,16,45],[28,1,28,2],[24,0,24,45],[25,1,25,2],[25,3,25,45],[26,1,26,2],[26,3,26,45],[27,1,27,2],[27,3,27,45],[28,3,28,45],[21,1,21,22],[21,24,21,45],[22,1,22,22],[22,24,22,45],[29,1,29,2],[29,3,29,45],[30,0,30,45],[32,0,32,45],[33,0,33,45],[34,0,35,34],[34,35,34,39],[34,40,34,42],[34,43,34,45],[35,35,35,39],[35,40,35,42],[35,43,35,45]]}
["Baccalauréat professionnel « maintenance des équipements industriels »"]
["Épreuve E2 (Unité U2) : ANALYSE ETPREPARATION D’UNE ACTIVITE DE MAINTENANCE"]
["Établissement : (tampon)",null,null,null,null,null,null,null,null,null,null,null,null,null,null,null,null,null,null,null,null,null,null,"Session : "]
[null,null,null,null,null,null,null,null,null,null,null,null,null,null,null,null,null,null,null,null,null,null,null,"Nom du candidat:"]
[null,null,null,null,null,null,null,null,null,null,null,null,null,null,null,null,null,null,null,null,null,null,null,"Prénom : "]
[null,null,null,null,null,null,null,null,null,null,null,null,null,null,null,null,null,null,null,null,null,null,null,"Date de l'évaluation:",null,null,null,null,null,null,null,null,null,null,null,null,null,null,null,null,null,null,null,null,null,null,null,"Situation d'évaluation :"]
["Lieu d’évaluation :"]
["      Etablissement",null,null,null,null,null,null,null,null,null,null,null,null,null,null,null,null,null,null,null,null,null,null,null,null,null,null,null,null,null,null,null,null,null,null,null,null,null,null,null,null,null,null,null,null,null,null,"E 2","E"]
["      Entreprise :       "]
["Description sommaire du travail demandé :"]
[]
[]
["Données et condition de réalisation."]
["X","Le dossier technique du bien sur supports papiers ou supports numériques",null,null,null,null,null,null,null,null,null,null,null,null,null,null,null,null,null,null,null,null,null,"X","Le cahier des charges fonctionnel"]
["X","Le bien et les conditions de son environnement",null,null,null,null,null,null,null,null,null,null,null,null,null,null,null,null,null,null,null,null,null,"X","L’équipement informatique"]
["X","Les normes",null,null,null,null,null,null,null,null,null,null,null,null,null,null,null,null,null,null,null,null,null,"X","Les logiciels"]
["X","Toutes documentations techniques",null,null,null,null,null,null,null,null,null,null,null,null,null,null,null,null,null,null,null,null,null,"X","Le plan de prévention"]
["X","Le document unique d’évaluation des risques",null,null,null,null,null,null,null,null,null,null,null,null,null,null,null,null,null,null,null,null,null,"X","Les outils descripteurs (grafcet, chronogramme…)"]
["X","Toutes informations en provenance de l’utilisateur",null,null,null,null,null,null,null,null,null,null,null,null,null,null,null,null,null,null,null,null,null,"X","Le constat de défaillance."]
["X","Les contraintes dans l’environnement",null,null,null,null,null,null,null,null,null,null,null,null,null,null,null,null,null,null,null,null,null,"X","Les impératifs de production."]
["X","Les délais d’interventions",null,null,null,null,null,null,null,null,null,null,null,null,null,null,null,null,null,null,null,null,null,"X","Toutes documentations techniques"]
["X","Un groupe de travail.",null,null,null,null,null,null,null,null,null,null,null,null,null,null,null,null,null,null,null,null,null,"X","Les moyens de communication"]
["X","La fiche de procédures",null,null,null,null,null,null,null,null,null,null,null,null,null,null,null,null,null,null,null,null,null,"X","La demande d’intervention ou le bon de travail."]
["     ÇRepérer les données fournies",null,null,null,null,null,null,null,null,null,null,null,null,null,null,null,null,null,null,null,null,null,null,null,"ÇRepérer les données fournies"]
["Travail demandé"]
["X","A1-T1",null,"Réaliser la maintenance corrective - Diagnostiquer les pannes."]
["X","A1-T2",null,"Réaliser la maintenance corrective - Préparer sa réparation, son dépannage. "]
["X","A1-T3",null,"Réaliser la maintenance corrective - Réaliser des réparations, des dépannages dans les domaines : mécanique, électrique, pneumatique, hydraulique."]
["X","A3-T1",null,"Mettre en œuvre des améliorations, des modifications - Proposer des améliorations ou des modifications"]
["X","A3-T2",null,"Mettre en œuvre des améliorations, des modifications - Préparer et réaliser l’amélioration ou la modification"]
["Consulter le référentiel des activités professionnelles pour obtenir le détail des tâches."]
["Ç Repérer les tâches demandées (ce sont celles qui correspondent à l’unité dans le référentiel de certification, à l’exclusion de toute autre)"]
["Appréciation globale et proposition de note : "]
[]
["Noms et signatures des évaluateurs :\n\n\n",null,null,null,null,null,null,null,null,null,null,null,null,null,null,null,null,null,null,null,null,null,null,null,null,null,null,null,null,null,null,null,null,null,null,"Note proposée :          ",null,null,null,null,null,null,null,"/20"]
[null,null,null,null,null,null,null,null,null,null,null,null,null,null,null,null,null,null,null,null,null,null,null,null,null,null,null,null,null,null,null,null,null,null,null,"Note affectée de son coefficient :",null,null,null,null,null,null,null,"/80"]

{"sheet":"U2_F","index":22,"n_rows":36,"n_cols":49,"rows_kept":36,"cut":false,"hidden":true,"merged":[[5,47,6,48],[6,0,6,45],[7,0,7,45],[7,47,8,47],[7,48,8,48],[8,0,8,45],[3,0,5,22],[3,23,3,29],[3,30,4,45],[4,23,4,29],[5,23,5,29],[17,1,17,22],[17,24,17,45],[0,0,0,45],[1,0,1,45],[2,0,2,22],[2,23,2,29],[2,30,2,45],[5,30,5,45],[9,0,9,45],[10,0,10,45],[12,0,12,45],[13,1,13,22],[13,24,13,45],[14,1,14,22],[14,24,14,45],[15,1,15,22],[18,1,18,22],[18,24,18,45],[19,1,19,22],[19,24,19,45],[20,1,20,22],[20,24,20,45],[15,24,15,45],[16,1,16,22],[16,24,16,45],[28,1,28,2],[24,0,24,45],[25,1,25,2],[25,3,25,45],[26,1,26,2],[26,3,26,45],[27,1,27,2],[27,3,27,45],[28,3,28,45],[21,1,21,22],[21,24,21,45],[22,1,22,22],[22,24,22,45],[29,1,29,2],[29,3,29,45],[30,0,30,45],[32,0,32,45],[33,0,33,45],[34,0,35,34],[34,35,34,39],[34,40,34,42],[34,43,34,45],[35,35,35,39],[35,40,35,42],[35,43,35,45]]}
["Baccalauréat professionnel « maintenance des équipements industriels »"]
["Épreuve E2 (Unité U2) : ANALYSE ETPREPARATION D’UNE ACTIVITE DE MAINTENANCE"]
["Établissement : (tampon)",null,null,null,null,null,null,null,null,null,null,null,null,null,null,null,null,null,null,null,null,null,null,"Session : "]
[null,null,null,null,null,null,null,null,null,null,null,null,null,null,null,null,null,null,null,null,null,null,null,"Nom du candidat:"]
[null,null,null,null,null,null,null,null,null,null,null,null,null,null,null,null,null,null,null,null,null,null,null,"Prénom : "]
[null,null,null,null,null,null,null,null,null,null,null,null,null,null,null,null,null,null,null,null,null,null,null,"Date de l'évaluation:",null,null,null,null,null,null,null,null,null,null,null,null,null,null,null,null,null,null,null,null,null,null,null,"Situation d'évaluation :"]
["Lieu d’évaluation :"]
["      Etablissement",null,null,null,null,null,null,null,null,null,null,null,null,null,null,null,null,null,null,null,null,null,null,null,null,null,null,null,null,null,null,null,null,null,null,null,null,null,null,null,null,null,null,null,null,null,null,"E 2","F"]
["      Entreprise :       "]
["Description sommaire du travail demandé :"]
[]
[]
["Données et condition de réalisation."]
["X","Le dossier technique du bien sur supports papiers ou supports numériques",null,null,null,null,null,null,null,null,null,null,null,null,null,null,null,null,null,null,null,null,null,"X","Le cahier des charges fonctionnel"]
["X","Le bien et les conditions de son environnement",null,null,null,null,null,null,null,null,null,null,null,null,null,null,null,null,null,null,null,null,null,"X","L’équipement informatique"]
["X","Les normes",null,null,null,null,null,null,null,null,null,null,null,null,null,null,null,null,null,null,null,null,null,"X","Les logiciels"]
["X","Toutes documentations techniques",null,null,null,null,null,null,null,null,null,null,null,null,null,null,null,null,null,null,null,null,null,"X","Le plan de prévention"]
["X","Le document unique d’évaluation des risques",null,null,null,null,null,null,null,null,null,null,null,null,null,null,null,null,null,null,null,null,null,"X","Les outils descripteurs (grafcet, chronogramme…)"]
["X","Toutes informations en provenance de l’utilisateur",null,null,null,null,null,null,null,null,null,null,null,null,null,null,null,null,null,null,null,null,null,"X","Le constat de défaillance."]
["X","Les contraintes dans l’environnement",null,null,null,null,null,null,null,null,null,null,null,null,null,null,null,null,null,null,null,null,null,"X","Les impératifs de production."]
["X","Les délais d’interventions",null,null,null,null,null,null,null,null,null,null,null,null,null,null,null,null,null,null,null,null,null,"X","Toutes documentations techniques"]
["X","Un groupe de travail.",null,null,null,null,null,null,null,null,null,null,null,null,null,null,null,null,null,null,null,null,null,"X","Les moyens de communication"]
["X","La fiche de procédures",null,null,null,null,null,null,null,null,null,null,null,null,null,null,null,null,null,null,null,null,null,"X","La demande d’intervention ou le bon de travail."]
["     ÇRepérer les données fournies",null,null,null,null,null,null,null,null,null,null,null,null,null,null,null,null,null,null,null,null,null,null,null,"ÇRepérer les données fournies"]
["Travail demandé"]
["X","A1-T1",null,"Réaliser la maintenance corrective - Diagnostiquer les pannes."]
["X","A1-T2",null,"Réaliser la maintenance corrective - Préparer sa réparation, son dépannage. "]
["X","A1-T3",null,"Réaliser la maintenance corrective - Réaliser des réparations, des dépannages dans les domaines : mécanique, électrique, pneumatique, hydraulique."]
["X","A3-T1",null,"Mettre en œuvre des améliorations, des modifications - Proposer des améliorations ou des modifications"]
["X","A3-T2",null,"Mettre en œuvre des améliorations, des modifications - Préparer et réaliser l’amélioration ou la modification"]
["Consulter le référentiel des activités professionnelles pour obtenir le détail des tâches."]
["Ç Repérer les tâches demandées (ce sont celles qui correspondent à l’unité dans le référentiel de certification, à l’exclusion de toute autre)"]
["Appréciation globale et proposition de note : "]
[]
["Noms et signatures des évaluateurs :\n\n\n",null,null,null,null,null,null,null,null,null,null,null,null,null,null,null,null,null,null,null,null,null,null,null,null,null,null,null,null,null,null,null,null,null,null,"Note proposée :          ",null,null,null,null,null,null,null,"/20"]
[null,null,null,null,null,null,null,null,null,null,null,null,null,null,null,null,null,null,null,null,null,null,null,null,null,null,null,null,null,null,null,null,null,null,null,"Note affectée de son coefficient :",null,null,null,null,null,null,null,"/80"]

{"sheet":"U2_G","index":23,"n_rows":36,"n_cols":49,"rows_kept":36,"cut":false,"hidden":true,"merged":[[5,47,6,48],[6,0,6,45],[7,0,7,45],[7,47,8,47],[7,48,8,48],[8,0,8,45],[3,0,5,22],[3,23,3,29],[3,30,4,45],[4,23,4,29],[5,23,5,29],[17,1,17,22],[17,24,17,45],[0,0,0,45],[1,0,1,45],[2,0,2,22],[2,23,2,29],[2,30,2,45],[5,30,5,45],[9,0,9,45],[10,0,10,45],[12,0,12,45],[13,1,13,22],[13,24,13,45],[14,1,14,22],[14,24,14,45],[15,1,15,22],[18,1,18,22],[18,24,18,45],[19,1,19,22],[19,24,19,45],[20,1,20,22],[20,24,20,45],[15,24,15,45],[16,1,16,22],[16,24,16,45],[28,1,28,2],[24,0,24,45],[25,1,25,2],[25,3,25,45],[26,1,26,2],[26,3,26,45],[27,1,27,2],[27,3,27,45],[28,3,28,45],[21,1,21,22],[21,24,21,45],[22,1,22,22],[22,24,22,45],[29,1,29,2],[29,3,29,45],[30,0,30,45],[32,0,32,45],[33,0,33,45],[34,0,35,34],[34,35,34,39],[34,40,34,42],[34,43,34,45],[35,35,35,39],[35,40,35,42],[35,43,35,45]]}
["Baccalauréat professionnel « maintenance des équipements industriels »"]
["Épreuve E2 (Unité U2) : ANALYSE ETPREPARATION D’UNE ACTIVITE DE MAINTENANCE"]
["Établissement : (tampon)",null,null,null,null,null,null,null,null,null,null,null,null,null,null,null,null,null,null,null,null,null,null,"Session : "]
[null,null,null,null,null,null,null,null,null,null,null,null,null,null,null,null,null,null,null,null,null,null,null,"Nom du candidat:"]
[null,null,null,null,null,null,null,null,null,null,null,null,null,null,null,null,null,null,null,null,null,null,null,"Prénom : "]
[null,null,null,null,null,null,null,null,null,null,null,null,null,null,null,null,null,null,null,null,null,null,null,"Date de l'évaluation:",null,null,null,null,null,null,null,null,null,null,null,null,null,null,null,null,null,null,null,null,null,null,null,"Situation d'évaluation :"]
["Lieu d’évaluation :"]
["      Etablissement",null,null,null,null,null,null,null,null,null,null,null,null,null,null,null,null,null,null,null,null,null,null,null,null,null,null,null,null,null,null,null,null,null,null,null,null,null,null,null,null,null,null,null,null,null,null,"E 2","G"]
["      Entreprise :       "]
["Description sommaire du travail demandé :"]
[]
[]
["Données et condition de réalisation."]
["X","Le dossier technique du bien sur supports papiers ou supports numériques",null,null,null,null,null,null,null,null,null,null,null,null,null,null,null,null,null,null,null,null,null,"X","Le cahier des charges fonctionnel"]
["X","Le bien et les conditions de son environnement",null,null,null,null,null,null,null,null,null,null,null,null,null,null,null,null,null,null,null,null,null,"X","L’équipement informatique"]
["X","Les normes",null,null,null,null,null,null,null,null,null,null,null,null,null,null,null,null,null,null,null,null,null,"X","Les logiciels"]
["X","Toutes documentations techniques",null,null,null,null,null,null,null,null,null,null,null,null,null,null,null,null,null,null,null,null,null,"X","Le plan de prévention"]
["X","Le document unique d’évaluation des risques",null,null,null,null,null,null,null,null,null,null,null,null,null,null,null,null,null,null,null,null,null,"X","Les outils descripteurs (grafcet, chronogramme…)"]
["X","Toutes informations en provenance de l’utilisateur",null,null,null,null,null,null,null,null,null,null,null,null,null,null,null,null,null,null,null,null,null,"X","Le constat de défaillance."]
["X","Les contraintes dans l’environnement",null,null,null,null,null,null,null,null,null,null,null,null,null,null,null,null,null,null,null,null,null,"X","Les impératifs de production."]
["X","Les délais d’interventions",null,null,null,null,null,null,null,null,null,null,null,null,null,null,null,null,null,null,null,null,null,"X","Toutes documentations techniques"]
["X","Un groupe de travail.",null,null,null,null,null,null,null,null,null,null,null,null,null,null,null,null,null,null,null,null,null,"X","Les moyens de communication"]
["X","La fiche de procédures",null,null,null,null,null,null,null,null,null,null,null,null,null,null,null,null,null,null,null,null,null,"X","La demande d’intervention ou le bon de travail."]
["     ÇRepérer les données fournies",null,null,null,null,null,null,null,null,null,null,null,null,null,null,null,null,null,null,null,null,null,null,null,"ÇRepérer les données fournies"]
["Travail demandé"]
["X","A1-T1",null,"Réaliser la maintenance corrective - Diagnostiquer les pannes."]
["X","A1-T2",null,"Réaliser la maintenance corrective - Préparer sa réparation, son dépannage. "]
["X","A1-T3",null,"Réaliser la maintenance corrective - Réaliser des réparations, des dépannages dans les domaines : mécanique, électrique, pneumatique, hydraulique."]
["X","A3-T1",null,"Mettre en œuvre des améliorations, des modifications - Proposer des améliorations ou des modifications"]
["X","A3-T2",null,"Mettre en œuvre des améliorations, des modifications - Préparer et réaliser l’amélioration ou la modification"]
["Consulter le référentiel des activités professionnelles pour obtenir le détail des tâches."]
["Ç Repérer les tâches demandées (ce sont celles qui correspondent à l’unité dans le référentiel de certification, à l’exclusion de toute autre)"]
["Appréciation globale et proposition de note : "]
[]
["Noms et signatures des évaluateurs :\n\n\n",null,null,null,null,null,null,null,null,null,null,null,null,null,null,null,null,null,null,null,null,null,null,null,null,null,null,null,null,null,null,null,null,null,null,"Note proposée :          ",null,null,null,null,null,null,null,"/20"]
[null,null,null,null,null,null,null,null,null,null,null,null,null,null,null,null,null,null,null,null,null,null,null,null,null,null,null,null,null,null,null,null,null,null,null,"Note affectée de son coefficient :",null,null,null,null,null,null,null,"/80"]

{"sheet":"U2_H","index":24,"n_rows":36,"n_cols":49,"rows_kept":36,"cut":false,"hidden":true,"merged":[[5,47,6,48],[6,0,6,45],[7,0,7,45],[7,47,8,47],[7,48,8,48],[8,0,8,45],[3,0,5,22],[3,23,3,29],[3,30,4,45],[4,23,4,29],[5,23,5,29],[17,1,17,22],[17,24,17,45],[0,0,0,45],[1,0,1,45],[2,0,2,22],[2,23,2,29],[2,30,2,45],[5,30,5,45],[9,0,9,45],[10,0,10,45],[12,0,12,45],[13,1,13,22],[13,24,13,45],[14,1,14,22],[14,24,14,45],[15,1,15,22],[18,1,18,22],[18,24,18,45],[19,1,19,22],[19,24,19,45],[20,1,20,22],[20,24,20,45],[15,24,15,45],[16,1,16,22],[16,24,16,45],[28,1,28,2],[24,0,24,45],[25,1,25,2],[25,3,25,45],[26,1,26,2],[26,3,26,45],[27,1,27,2],[27,3,27,45],[28,3,28,45],[21,1,21,22],[21,24,21,45],[22,1,22,22],[22,24,22,45],[29,1,29,2],[29,3,29,45],[30,0,30,45],[32,0,32,45],[33,0,33,45],[34,0,35,34],[34,35,34,39],[34,40,34,42],[34,43,34,45],[35,35,35,39],[35,40,35,42],[35,43,35,45]]}
["Baccalauréat professionnel « maintenance des équipements industriels »"]
["Épreuve E2 (Unité U2) : ANALYSE ETPREPARATION D’UNE ACTIVITE DE MAINTENANCE"]
["Établissement : (tampon)",null,null,null,null,null,null,null,null,null,null,null,null,null,null,null,null,null,null,null,null,null,null,"Session : "]
[null,null,null,null,null,null,null,null,null,null,null,null,null,null,null,null,null,null,null,null,null,null,null,"Nom du candidat:"]
[null,null,null,null,null,null,null,null,null,null,null,null,null,null,null,null,null,null,null,null,null,null,null,"Prénom : "]
[null,null,null,null,null,null,null,null,null,null,null,null,null,null,null,null,null,null,null,null,null,null,null,"Date de l'évaluation:",null,null,null,null,null,null,null,null,null,null,null,null,null,null,null,null,null,null,null,null,null,null,null,"Situation d'évaluation :"]
["Lieu d’évaluation :"]
["      Etablissement",null,null,null,null,null,null,null,null,null,null,null,null,null,null,null,null,null,null,null,null,null,null,null,null,null,null,null,null,null,null,null,null,null,null,null,null,null,null,null,null,null,null,null,null,null,null,"E 2","H"]
["      Entreprise :       "]
["Description sommaire du travail demandé :"]
[]
[]
["Données et condition de réalisation."]
["X","Le dossier technique du bien sur supports papiers ou supports numériques",null,null,null,null,null,null,null,null,null,null,null,null,null,null,null,null,null,null,null,null,null,"X","Le cahier des charges fonctionnel"]
["X","Le bien et les conditions de son environnement",null,null,null,null,null,null,null,null,null,null,null,null,null,null,null,null,null,null,null,null,null,"X","L’équipement informatique"]
["X","Les normes",null,null,null,null,null,null,null,null,null,null,null,null,null,null,null,null,null,null,null,null,null,"X","Les logiciels"]
["X","Toutes documentations techniques",null,null,null,null,null,null,null,null,null,null,null,null,null,null,null,null,null,null,null,null,null,"X","Le plan de prévention"]
["X","Le document unique d’évaluation des risques",null,null,null,null,null,null,null,null,null,null,null,null,null,null,null,null,null,null,null,null,null,"X","Les outils descripteurs (grafcet, chronogramme…)"]
["X","Toutes informations en provenance de l’utilisateur",null,null,null,null,null,null,null,null,null,null,null,null,null,null,null,null,null,null,null,null,null,"X","Le constat de défaillance."]
["X","Les contraintes dans l’environnement",null,null,null,null,null,null,null,null,null,null,null,null,null,null,null,null,null,null,null,null,null,"X","Les impératifs de production."]
["X","Les délais d’interventions",null,null,null,null,null,null,null,null,null,null,null,null,null,null,null,null,null,null,null,null,null,"X","Toutes documentations techniques"]
["X","Un groupe de travail.",null,null,null,null,null,null,null,null,null,null,null,null,null,null,null,null,null,null,null,null,null,"X","Les moyens de communication"]
["X","La fiche de procédures",null,null,null,null,null,null,null,null,null,null,null,null,null,null,null,null,null,null,null,null,null,"X","La demande d’intervention ou le bon de travail."]
["     ÇRepérer les données fournies",null,null,null,null,null,null,null,null,null,null,null,null,null,null,null,null,null,null,null,null,null,null,null,"ÇRepérer les données fournies"]
["Travail demandé"]
["X","A1-T1",null,"Réaliser la maintenance corrective - Diagnostiquer les pannes."]
["X","A1-T2",null,"Réaliser la maintenance corrective - Préparer sa réparation, son dépannage. "]
["X","A1-T3",null,"Réaliser la maintenance corrective - Réaliser des réparations, des dépannages dans les domaines : mécanique, électrique, pneumatique, hydraulique."]
["X","A3-T1",null,"Mettre en œuvre des améliorations, des modifications - Proposer des améliorations ou des modifications"]
["X","A3-T2",null,"Mettre en œuvre des améliorations, des modifications - Préparer et réaliser l’amélioration ou la modification"]
["Consulter le référentiel des activités professionnelles pour obtenir le détail des tâches."]
["Ç Repérer les tâches demandées (ce sont celles qui correspondent à l’unité dans le référentiel de certification, à l’exclusion de toute autre)"]
["Appréciation globale et proposition de note : "]
[]
["Noms et signatures des évaluateurs :\n\n\n",null,null,null,null,null,null,null,null,null,null,null,null,null,null,null,null,null,null,null,null,null,null,null,null,null,null,null,null,null,null,null,null,null,null,"Note proposée :          ",null,null,null,null,null,null,null,"/20"]
[null,null,null,null,null,null,null,null,null,null,null,null,null,null,null,null,null,null,null,null,null,null,null,null,null,null,null,null,null,null,null,null,null,null,null,"Note affectée de son coefficient :",null,null,null,null,null,null,null,"/80"]

{"sheet":"U32_A","index":25,"n_rows":34,"n_cols":49,"rows_kept":34,"cut":false,"hidden":true,"merged":[[16,1,16,22],[16,24,16,45],[17,1,17,22],[12,0,12,45],[13,1,13,22],[13,24,13,45],[15,1,15,22],[15,24,15,45],[17,24,17,45],[0,0,0,45],[1,0,1,45],[2,0,2,22],[2,23,2,29],[2,30,2,45],[5,47,6,48],[7,47,8,47],[7,48,8,48],[14,1,14,22],[14,24,14,45],[5,30,5,45],[6,0,6,45],[7,0,7,45],[8,0,8,45],[9,0,9,45],[10,0,10,45],[3,0,5,22],[3,23,3,29],[3,30,4,45],[4,23,4,29],[5,23,5,29],[18,1,18,22],[18,24,18,45],[26,1,26,2],[24,0,24,45],[25,1,25,2],[22,1,22,22],[22,24,22,45],[19,1,19,22],[19,24,19,45],[20,1,20,22],[20,24,20,45],[21,1,21,22],[21,24,21,45],[28,0,28,45],[30,0,30,45],[25,3,25,45],[26,3,26,45],[27,0,27,45],[31,0,31,45],[32,0,33,34],[32,35,32,39],[32,40,32,42],[32,43,32,45],[33,35,33,39],[33,40,33,42],[33,43,33,45]]}
["Baccalauréat professionnel « maintenance des équipements industriels »"]
["Épreuve E32 (Unité U32) : INTERVENTION SUR UN EQUIPEMENT MECANIQUE"]
["Établissement : (tampon)",null,null,null,null,null,null,null,null,null,null,null,null,null,null,null,null,null,null,null,null,null,null,"Session : "]
[null,null,null,null,null,null,null,null,null,null,null,null,null,null,null,null,null,null,null,null,null,null,null,"Nom du candidat:"]
[null,null,null,null,null,null,null,null,null,null,null,null,null,null,null,null,null,null,null,null,null,null,null,"Prénom : "]
[null,null,null,null,null,null,null,null,null,null,null,null,null,null,null,null,null,null,null,null,null,null,null,"Date de l'évaluation:",null,null,null,null,null,null,null,null,null,null,null,null,null,null,null,null,null,null,null,null,null,null,null,"Situation d'évaluation :"]
["Lieu d’évaluation :"]
["      Etablissement",null,null,null,null,null,null,null,null,null,null,null,null,null,null,null,null,null,null,null,null,null,null,null,null,null,null,null,null,null,null,null,null,null,null,null,null,null,null,null,null,null,null,null,null,null,null,"E 32","A"]
["      Entreprise :       "]
["Description sommaire du travail demandé :"]
[]
[]
["Données fournies au candidat"]
["X","Le bien et les conditions de son environnement",null,null,null,null,null,null,null,null,null,null,null,null,null,null,null,null,null,null,null,null,null,"X","Les composants et les conditions de leur environnement"]
["X","Le dossier technique du bien et son dossier de maintenance  sur supports papiers ou supports numériques",null,null,null,null,null,null,null,null,null,null,null,null,null,null,null,null,null,null,null,null,null,"X","Toutes informations en provenance de l’utilisateur ou d’autres intervenants"]
["X","Les consignes d’exploitation",null,null,null,null,null,null,null,null,null,null,null,null,null,null,null,null,null,null,null,null,null,"X","Les pièces de rechange, les consommables"]
["X","Le bon de travail",null,null,null,null,null,null,null,null,null,null,null,null,null,null,null,null,null,null,null,null,null,"X","Les équipements de protection individuels et collectifs"]
["X","Le document unique d’évaluation des risques",null,null,null,null,null,null,null,null,null,null,null,null,null,null,null,null,null,null,null,null,null,"X","Les outillages, matériels de contrôle, de mesure, moyens de manutention."]
["X","Le carnet de prescription de sécurité électrique",null,null,null,null,null,null,null,null,null,null,null,null,null,null,null,null,null,null,null,null,null,"X","Toutes documentations techniques"]
["X","Les normes",null,null,null,null,null,null,null,null,null,null,null,null,null,null,null,null,null,null,null,null,null,"X","Les consignes et/ou procédures écrites"]
["X","Le plan d’implantation du bien",null,null,null,null,null,null,null,null,null,null,null,null,null,null,null,null,null,null,null,null,null,"X","Le plan de prévention"]
[]
[]
["     ÇRepérer les données fournies",null,null,null,null,null,null,null,null,null,null,null,null,null,null,null,null,null,null,null,null,null,null,null,"ÇRepérer les données fournies"]
["Travail demandé"]
["X","A1-T3",null,"Réaliser la maintenance corrective - Réaliser des réparations, des dépannages dans les domaines : mécanique, électrique, pneumatique, hydraulique."]
["X","A2-T2",null,"Réaliser la maintenance préventive - Réaliser des opérations planifiées."]
["L’ENSEMBLE DES ACTIVITES ET DES TACHES SONT MOBILISEES EN CE QUI CONCERNE LA COMPETENCE CP1.7 QUI A TRAIT A LA SECURITE ET A LA PREVENTION DES RISQUES"]
["Consulter le référentiel des activités professionnelles pour obtenir le détail des tâches."]
["Ç Repérer les tâches demandées (ce sont celles qui correspondent à l’unité dans le référentiel de certification, à l’exclusion de toute autre)"]
["Appréciation globale et proposition de note : "]
[]
["Noms et signatures des évaluateurs :\n\n\n",null,null,null,null,null,null,null,null,null,null,null,null,null,null,null,null,null,null,null,null,null,null,null,null,null,null,null,null,null,null,null,null,null,null,"Note proposée :          ",null,null,null,null,null,null,null,"/20"]
[null,null,null,null,null,null,null,null,null,null,null,null,null,null,null,null,null,null,null,null,null,null,null,null,null,null,null,null,null,null,null,null,null,null,null,"Note affectée de son coefficient :",null,null,null,null,null,null,null,"/60"]

{"sheet":"U32_B","index":26,"n_rows":34,"n_cols":49,"rows_kept":34,"cut":false,"hidden":true,"merged":[[32,0,33,34],[32,35,32,39],[32,40,32,42],[32,43,32,45],[33,35,33,39],[33,40,33,42],[33,43,33,45],[20,1,20,22],[20,24,20,45],[30,0,30,45],[31,0,31,45],[28,0,28,45],[27,0,27,45],[24,0,24,45],[25,1,25,2],[25,3,25,45],[26,1,26,2],[26,3,26,45],[14,1,14,22],[14,24,14,45],[21,1,21,22],[21,24,21,45],[22,1,22,22],[22,24,22,45],[15,1,15,22],[15,24,15,45],[16,1,16,22],[16,24,16,45],[17,1,17,22],[17,24,17,45],[18,1,18,22],[18,24,18,45],[19,1,19,22],[19,24,19,45],[9,0,9,45],[10,0,10,45],[12,0,12,45],[13,1,13,22],[13,24,13,45],[0,0,0,45],[1,0,1,45],[2,0,2,22],[2,23,2,29],[2,30,2,45],[5,30,5,45],[5,47,6,48],[6,0,6,45],[7,0,7,45],[7,47,8,47],[7,48,8,48],[8,0,8,45],[3,0,5,22],[3,23,3,29],[3,30,4,45],[4,23,4,29],[5,23,5,29]]}
["Baccalauréat professionnel « maintenance des équipements industriels »"]
["Épreuve E32 (Unité U32) : INTERVENTION SUR UN EQUIPEMENT MECANIQUE"]
["Établissement : (tampon)",null,null,null,null,null,null,null,null,null,null,null,null,null,null,null,null,null,null,null,null,null,null,"Session : "]
[null,null,null,null,null,null,null,null,null,null,null,null,null,null,null,null,null,null,null,null,null,null,null,"Nom du candidat:"]
[null,null,null,null,null,null,null,null,null,null,null,null,null,null,null,null,null,null,null,null,null,null,null,"Prénom : "]
[null,null,null,null,null,null,null,null,null,null,null,null,null,null,null,null,null,null,null,null,null,null,null,"Date de l'évaluation:",null,null,null,null,null,null,null,null,null,null,null,null,null,null,null,null,null,null,null,null,null,null,null,"Situation d'évaluation :"]
["Lieu d’évaluation :"]
["      Etablissement",null,null,null,null,null,null,null,null,null,null,null,null,null,null,null,null,null,null,null,null,null,null,null,null,null,null,null,null,null,null,null,null,null,null,null,null,null,null,null,null,null,null,null,null,null,null,"E 32","B"]
["      Entreprise :       "]
["Description sommaire du travail demandé :"]
[]
[]
["Données fournies au candidat"]
["X","Le bien et les conditions de son environnement",null,null,null,null,null,null,null,null,null,null,null,null,null,null,null,null,null,null,null,null,null,"X","Les composants et les conditions de leur environnement"]
["X","Le dossier technique du bien et son dossier de maintenance  sur supports papiers ou supports numériques",null,null,null,null,null,null,null,null,null,null,null,null,null,null,null,null,null,null,null,null,null,"X","Toutes informations en provenance de l’utilisateur ou d’autres intervenants"]
["X","Les consignes d’exploitation",null,null,null,null,null,null,null,null,null,null,null,null,null,null,null,null,null,null,null,null,null,"X","Les pièces de rechange, les consommables"]
["X","Le bon de travail",null,null,null,null,null,null,null,null,null,null,null,null,null,null,null,null,null,null,null,null,null,"X","Les équipements de protection individuels et collectifs"]
["X","Le document unique d’évaluation des risques",null,null,null,null,null,null,null,null,null,null,null,null,null,null,null,null,null,null,null,null,null,"X","Les outillages, matériels de contrôle, de mesure, moyens de manutention."]
["X","Le carnet de prescription de sécurité électrique",null,null,null,null,null,null,null,null,null,null,null,null,null,null,null,null,null,null,null,null,null,"X","Toutes documentations techniques"]
["X","Les normes",null,null,null,null,null,null,null,null,null,null,null,null,null,null,null,null,null,null,null,null,null,"X","Les consignes et/ou procédures écrites"]
["X","Le plan d’implantation du bien",null,null,null,null,null,null,null,null,null,null,null,null,null,null,null,null,null,null,null,null,null,"X","Le plan de prévention"]
[]
[]
["     ÇRepérer les données fournies",null,null,null,null,null,null,null,null,null,null,null,null,null,null,null,null,null,null,null,null,null,null,null,"ÇRepérer les données fournies"]
["Travail demandé"]
["X","A1-T3",null,"Réaliser la maintenance corrective - Réaliser des réparations, des dépannages dans les domaines : mécanique, électrique, pneumatique, hydraulique."]
["X","A2-T2",null,"Réaliser la maintenance préventive - Réaliser des opérations planifiées."]
["L’ENSEMBLE DES ACTIVITES ET DES TACHES SONT MOBILISEES EN CE QUI CONCERNE LA COMPETENCE CP1.7 QUI A TRAIT A LA SECURITE ET A LA PREVENTION DES RISQUES"]
["Consulter le référentiel des activités professionnelles pour obtenir le détail des tâches."]
["Ç Repérer les tâches demandées (ce sont celles qui correspondent à l’unité dans le référentiel de certification, à l’exclusion de toute autre)"]
["Appréciation globale et proposition de note : "]
[]
["Noms et signatures des évaluateurs :\n\n\n",null,null,null,null,null,null,null,null,null,null,null,null,null,null,null,null,null,null,null,null,null,null,null,null,null,null,null,null,null,null,null,null,null,null,"Note proposée :          ",null,null,null,null,null,null,null,"/20"]
[null,null,null,null,null,null,null,null,null,null,null,null,null,null,null,null,null,null,null,null,null,null,null,null,null,null,null,null,null,null,null,null,null,null,null,"Note affectée de son coefficient :",null,null,null,null,null,null,null,"/60"]

{"sheet":"U32_C","index":27,"n_rows":34,"n_cols":49,"rows_kept":34,"cut":false,"hidden":true,"merged":[[32,0,33,34],[32,35,32,39],[32,40,32,42],[32,43,32,45],[33,35,33,39],[33,40,33,42],[33,43,33,45],[20,1,20,22],[20,24,20,45],[30,0,30,45],[31,0,31,45],[28,0,28,45],[27,0,27,45],[24,0,24,45],[25,1,25,2],[25,3,25,45],[26,1,26,2],[26,3,26,45],[14,1,14,22],[14,24,14,45],[21,1,21,22],[21,24,21,45],[22,1,22,22],[22,24,22,45],[15,1,15,22],[15,24,15,45],[16,1,16,22],[16,24,16,45],[17,1,17,22],[17,24,17,45],[18,1,18,22],[18,24,18,45],[19,1,19,22],[19,24,19,45],[9,0,9,45],[10,0,10,45],[12,0,12,45],[13,1,13,22],[13,24,13,45],[0,0,0,45],[1,0,1,45],[2,0,2,22],[2,23,2,29],[2,30,2,45],[5,30,5,45],[5,47,6,48],[6,0,6,45],[7,0,7,45],[7,47,8,47],[7,48,8,48],[8,0,8,45],[3,0,5,22],[3,23,3,29],[3,30,4,45],[4,23,4,29],[5,23,5,29]]}
["Baccalauréat professionnel « maintenance des équipements industriels »"]
["Épreuve E32 (Unité U32) : INTERVENTION SUR UN EQUIPEMENT MECANIQUE"]
["Établissement : (tampon)",null,null,null,null,null,null,null,null,null,null,null,null,null,null,null,null,null,null,null,null,null,null,"Session : "]
[null,null,null,null,null,null,null,null,null,null,null,null,null,null,null,null,null,null,null,null,null,null,null,"Nom du candidat:"]
[null,null,null,null,null,null,null,null,null,null,null,null,null,null,null,null,null,null,null,null,null,null,null,"Prénom : "]
[null,null,null,null,null,null,null,null,null,null,null,null,null,null,null,null,null,null,null,null,null,null,null,"Date de l'évaluation:",null,null,null,null,null,null,null,null,null,null,null,null,null,null,null,null,null,null,null,null,null,null,null,"Situation d'évaluation :"]
["Lieu d’évaluation :"]
["      Etablissement",null,null,null,null,null,null,null,null,null,null,null,null,null,null,null,null,null,null,null,null,null,null,null,null,null,null,null,null,null,null,null,null,null,null,null,null,null,null,null,null,null,null,null,null,null,null,"E 32","C"]
["      Entreprise :       "]
["Description sommaire du travail demandé :"]
[]
[]
["Données fournies au candidat"]
["X","Le bien et les conditions de son environnement",null,null,null,null,null,null,null,null,null,null,null,null,null,null,null,null,null,null,null,null,null,"X","Les composants et les conditions de leur environnement"]
["X","Le dossier technique du bien et son dossier de maintenance  sur supports papiers ou supports numériques",null,null,null,null,null,null,null,null,null,null,null,null,null,null,null,null,null,null,null,null,null,"X","Toutes informations en provenance de l’utilisateur ou d’autres intervenants"]
["X","Les consignes d’exploitation",null,null,null,null,null,null,null,null,null,null,null,null,null,null,null,null,null,null,null,null,null,"X","Les pièces de rechange, les consommables"]
["X","Le bon de travail",null,null,null,null,null,null,null,null,null,null,null,null,null,null,null,null,null,null,null,null,null,"X","Les équipements de protection individuels et collectifs"]
["X","Le document unique d’évaluation des risques",null,null,null,null,null,null,null,null,null,null,null,null,null,null,null,null,null,null,null,null,null,"X","Les outillages, matériels de contrôle, de mesure, moyens de manutention."]
["X","Le carnet de prescription de sécurité électrique",null,null,null,null,null,null,null,null,null,null,null,null,null,null,null,null,null,null,null,null,null,"X","Toutes documentations techniques"]
["X","Les normes",null,null,null,null,null,null,null,null,null,null,null,null,null,null,null,null,null,null,null,null,null,"X","Les consignes et/ou procédures écrites"]
["X","Le plan d’implantation du bien",null,null,null,null,null,null,null,null,null,null,null,null,null,null,null,null,null,null,null,null,null,"X","Le plan de prévention"]
[]
[]
["     ÇRepérer les données fournies",null,null,null,null,null,null,null,null,null,null,null,null,null,null,null,null,null,null,null,null,null,null,null,"ÇRepérer les données fournies"]
["Travail demandé"]
["X","A1-T3",null,"Réaliser la maintenance corrective - Réaliser des réparations, des dépannages dans les domaines : mécanique, électrique, pneumatique, hydraulique."]
["X","A2-T2",null,"Réaliser la maintenance préventive - Réaliser des opérations planifiées."]
["L’ENSEMBLE DES ACTIVITES ET DES TACHES SONT MOBILISEES EN CE QUI CONCERNE LA COMPETENCE CP1.7 QUI A TRAIT A LA SECURITE ET A LA PREVENTION DES RISQUES"]
["Consulter le référentiel des activités professionnelles pour obtenir le détail des tâches."]
["Ç Repérer les tâches demandées (ce sont celles qui correspondent à l’unité dans le référentiel de certification, à l’exclusion de toute autre)"]
["Appréciation globale et proposition de note : "]
[]
["Noms et signatures des évaluateurs :\n\n\n",null,null,null,null,null,null,null,null,null,null,null,null,null,null,null,null,null,null,null,null,null,null,null,null,null,null,null,null,null,null,null,null,null,null,"Note proposée :          ",null,null,null,null,null,null,null,"/20"]
[null,null,null,null,null,null,null,null,null,null,null,null,null,null,null,null,null,null,null,null,null,null,null,null,null,null,null,null,null,null,null,null,null,null,null,"Note affectée de son coefficient :",null,null,null,null,null,null,null,"/60"]

{"sheet":"U32_D","index":28,"n_rows":34,"n_cols":49,"rows_kept":34,"cut":false,"hidden":true,"merged":[[32,0,33,34],[32,35,32,39],[32,40,32,42],[32,43,32,45],[33,35,33,39],[33,40,33,42],[33,43,33,45],[20,1,20,22],[20,24,20,45],[30,0,30,45],[31,0,31,45],[28,0,28,45],[27,0,27,45],[24,0,24,45],[25,1,25,2],[25,3,25,45],[26,1,26,2],[26,3,26,45],[14,1,14,22],[14,24,14,45],[21,1,21,22],[21,24,21,45],[22,1,22,22],[22,24,22,45],[15,1,15,22],[15,24,15,45],[16,1,16,22],[16,24,16,45],[17,1,17,22],[17,24,17,45],[18,1,18,22],[18,24,18,45],[19,1,19,22],[19,24,19,45],[9,0,9,45],[10,0,10,45],[12,0,12,45],[13,1,13,22],[13,24,13,45],[0,0,0,45],[1,0,1,45],[2,0,2,22],[2,23,2,29],[2,30,2,45],[5,30,5,45],[5,47,6,48],[6,0,6,45],[7,0,7,45],[7,47,8,47],[7,48,8,48],[8,0,8,45],[3,0,5,22],[3,23,3,29],[3,30,4,45],[4,23,4,29],[5,23,5,29]]}
["Baccalauréat professionnel « maintenance des équipements industriels »"]
["Épreuve E32 (Unité U32) : INTERVENTION SUR UN EQUIPEMENT MECANIQUE"]
["Établissement : (tampon)",null,null,null,null,null,null,null,null,null,null,null,null,null,null,null,null,null,null,null,null,null,null,"Session : "]
[null,null,null,null,null,null,null,null,null,null,null,null,null,null,null,null,null,null,null,null,null,null,null,"Nom du candidat:"]
[null,null,null,null,null,null,null,null,null,null,null,null,null,null,null,null,null,null,null,null,null,null,null,"Prénom : "]
[null,null,null,null,null,null,null,null,null,null,null,null,null,null,null,null,null,null,null,null,null,null,null,"Date de l'évaluation:",null,null,null,null,null,null,null,null,null,null,null,null,null,null,null,null,null,null,null,null,null,null,null,"Situation d'évaluation :"]
["Lieu d’évaluation :"]
["      Etablissement",null,null,null,null,null,null,null,null,null,null,null,null,null,null,null,null,null,null,null,null,null,null,null,null,null,null,null,null,null,null,null,null,null,null,null,null,null,null,null,null,null,null,null,null,null,null,"E 32","D"]
["      Entreprise :       "]
["Description sommaire du travail demandé :"]
[]
[]
["Données fournies au candidat"]
["X","Le bien et les conditions de son environnement",null,null,null,null,null,null,null,null,null,null,null,null,null,null,null,null,null,null,null,null,null,"X","Les composants et les conditions de leur environnement"]
["X","Le dossier technique du bien et son dossier de maintenance  sur supports papiers ou supports numériques",null,null,null,null,null,null,null,null,null,null,null,null,null,null,null,null,null,null,null,null,null,"X","Toutes informations en provenance de l’utilisateur ou d’autres intervenants"]
["X","Les consignes d’exploitation",null,null,null,null,null,null,null,null,null,null,null,null,null,null,null,null,null,null,null,null,null,"X","Les pièces de rechange, les consommables"]
["X","Le bon de travail",null,null,null,null,null,null,null,null,null,null,null,null,null,null,null,null,null,null,null,null,null,"X","Les équipements de protection individuels et collectifs"]
["X","Le document unique d’évaluation des risques",null,null,null,null,null,null,null,null,null,null,null,null,null,null,null,null,null,null,null,null,null,"X","Les outillages, matériels de contrôle, de mesure, moyens de manutention."]
["X","Le carnet de prescription de sécurité électrique",null,null,null,null,null,null,null,null,null,null,null,null,null,null,null,null,null,null,null,null,null,"X","Toutes documentations techniques"]
["X","Les normes",null,null,null,null,null,null,null,null,null,null,null,null,null,null,null,null,null,null,null,null,null,"X","Les consignes et/ou procédures écrites"]
["X","Le plan d’implantation du bien",null,null,null,null,null,null,null,null,null,null,null,null,null,null,null,null,null,null,null,null,null,"X","Le plan de prévention"]
[]
[]
["     ÇRepérer les données fournies",null,null,null,null,null,null,null,null,null,null,null,null,null,null,null,null,null,null,null,null,null,null,null,"ÇRepérer les données fournies"]
["Travail demandé"]
["X","A1-T3",null,"Réaliser la maintenance corrective - Réaliser des réparations, des dépannages dans les domaines : mécanique, électrique, pneumatique, hydraulique."]
["X","A2-T2",null,"Réaliser la maintenance préventive - Réaliser des opérations planifiées."]
["L’ENSEMBLE DES ACTIVITES ET DES TACHES SONT MOBILISEES EN CE QUI CONCERNE LA COMPETENCE CP1.7 QUI A TRAIT A LA SECURITE ET A LA PREVENTION DES RISQUES"]
["Consulter le référentiel des activités professionnelles pour obtenir le détail des tâches."]
["Ç Repérer les tâches demandées (ce sont celles qui correspondent à l’unité dans le référentiel de certification, à l’exclusion de toute autre)"]
["Appréciation globale et proposition de note : "]
[]
["Noms et signatures des évaluateurs :\n\n\n",null,null,null,null,null,null,null,null,null,null,null,null,null,null,null,null,null,null,null,null,null,null,null,null,null,null,null,null,null,null,null,null,null,null,"Note proposée :          ",null,null,null,null,null,null,null,"/20"]
[null,null,null,null,null,null,null,null,null,null,null,null,null,null,null,null,null,null,null,null,null,null,null,null,null,null,null,null,null,null,null,null,null,null,null,"Note affectée de son coefficient :",null,null,null,null,null,null,null,"/60"]

{"sheet":"U32_E","index":29,"n_rows":34,"n_cols":49,"rows_kept":34,"cut":false,"hidden":true,"merged":[[32,0,33,34],[32,35,32,39],[32,40,32,42],[32,43,32,45],[33,35,33,39],[33,40,33,42],[33,43,33,45],[20,1,20,22],[20,24,20,45],[30,0,30,45],[31,0,31,45],[28,0,28,45],[27,0,27,45],[24,0,24,45],[25,1,25,2],[25,3,25,45],[26,1,26,2],[26,3,26,45],[14,1,14,22],[14,24,14,45],[21,1,21,22],[21,24,21,45],[22,1,22,22],[22,24,22,45],[15,1,15,22],[15,24,15,45],[16,1,16,22],[16,24,16,45],[17,1,17,22],[17,24,17,45],[18,1,18,22],[18,24,18,45],[19,1,19,22],[19,24,19,45],[9,0,9,45],[10,0,10,45],[12,0,12,45],[13,1,13,22],[13,24,13,45],[0,0,0,45],[1,0,1,45],[2,0,2,22],[2,23,2,29],[2,30,2,45],[5,30,5,45],[5,47,6,48],[6,0,6,45],[7,0,7,45],[7,47,8,47],[7,48,8,48],[8,0,8,45],[3,0,5,22],[3,23,3,29],[3,30,4,45],[4,23,4,29],[5,23,5,29]]}
["Baccalauréat professionnel « maintenance des équipements industriels »"]
["Épreuve E32 (Unité U32) : INTERVENTION SUR UN EQUIPEMENT MECANIQUE"]
["Établissement : (tampon)",null,null,null,null,null,null,null,null,null,null,null,null,null,null,null,null,null,null,null,null,null,null,"Session : "]
[null,null,null,null,null,null,null,null,null,null,null,null,null,null,null,null,null,null,null,null,null,null,null,"Nom du candidat:"]
[null,null,null,null,null,null,null,null,null,null,null,null,null,null,null,null,null,null,null,null,null,null,null,"Prénom : "]
[null,null,null,null,null,null,null,null,null,null,null,null,null,null,null,null,null,null,null,null,null,null,null,"Date de l'évaluation:",null,null,null,null,null,null,null,null,null,null,null,null,null,null,null,null,null,null,null,null,null,null,null,"Situation d'évaluation :"]
["Lieu d’évaluation :"]
["      Etablissement",null,null,null,null,null,null,null,null,null,null,null,null,null,null,null,null,null,null,null,null,null,null,null,null,null,null,null,null,null,null,null,null,null,null,null,null,null,null,null,null,null,null,null,null,null,null,"E 32","E"]
["      Entreprise :       "]
["Description sommaire du travail demandé :"]
[]
[]
["Données fournies au candidat"]
["X","Le bien et les conditions de son environnement",null,null,null,null,null,null,null,null,null,null,null,null,null,null,null,null,null,null,null,null,null,"X","Les composants et les conditions de leur environnement"]
["X","Le dossier technique du bien et son dossier de maintenance  sur supports papiers ou supports numériques",null,null,null,null,null,null,null,null,null,null,null,null,null,null,null,null,null,null,null,null,null,"X","Toutes informations en provenance de l’utilisateur ou d’autres intervenants"]
["X","Les consignes d’exploitation",null,null,null,null,null,null,null,null,null,null,null,null,null,null,null,null,null,null,null,null,null,"X","Les pièces de rechange, les consommables"]
["X","Le bon de travail",null,null,null,null,null,null,null,null,null,null,null,null,null,null,null,null,null,null,null,null,null,"X","Les équipements de protection individuels et collectifs"]
["X","Le document unique d’évaluation des risques",null,null,null,null,null,null,null,null,null,null,null,null,null,null,null,null,null,null,null,null,null,"X","Les outillages, matériels de contrôle, de mesure, moyens de manutention."]
["X","Le carnet de prescription de sécurité électrique",null,null,null,null,null,null,null,null,null,null,null,null,null,null,null,null,null,null,null,null,null,"X","Toutes documentations techniques"]
["X","Les normes",null,null,null,null,null,null,null,null,null,null,null,null,null,null,null,null,null,null,null,null,null,"X","Les consignes et/ou procédures écrites"]
["X","Le plan d’implantation du bien",null,null,null,null,null,null,null,null,null,null,null,null,null,null,null,null,null,null,null,null,null,"X","Le plan de prévention"]
[]
[]
["     ÇRepérer les données fournies",null,null,null,null,null,null,null,null,null,null,null,null,null,null,null,null,null,null,null,null,null,null,null,"ÇRepérer les données fournies"]
["Travail demandé"]
["X","A1-T3",null,"Réaliser la maintenance corrective - Réaliser des réparations, des dépannages dans les domaines : mécanique, électrique, pneumatique, hydraulique."]
["X","A2-T2",null,"Réaliser la maintenance préventive - Réaliser des opérations planifiées."]
["L’ENSEMBLE DES ACTIVITES ET DES TACHES SONT MOBILISEES EN CE QUI CONCERNE LA COMPETENCE CP1.7 QUI A TRAIT A LA SECURITE ET A LA PREVENTION DES RISQUES"]
["Consulter le référentiel des activités professionnelles pour obtenir le détail des tâches."]
["Ç Repérer les tâches demandées (ce sont celles qui correspondent à l’unité dans le référentiel de certification, à l’exclusion de toute autre)"]
["Appréciation globale et proposition de note : "]
[]
["Noms et signatures des évaluateurs :\n\n\n",null,null,null,null,null,null,null,null,null,null,null,null,null,null,null,null,null,null,null,null,null,null,null,null,null,null,null,null,null,null,null,null,null,null,"Note proposée :          ",null,null,null,null,null,null,null,"/20"]
[null,null,null,null,null,null,null,null,null,null,null,null,null,null,null,null,null,null,null,null,null,null,null,null,null,null,null,null,null,null,null,null,null,null,null,"Note affectée de son coefficient :",null,null,null,null,null,null,null,"/60"]

{"sheet":"U32_F","index":30,"n_rows":34,"n_cols":49,"rows_kept":34,"cut":false,"hidden":true,"merged":[[32,0,33,34],[32,35,32,39],[32,40,32,42],[32,43,32,45],[33,35,33,39],[33,40,33,42],[33,43,33,45],[20,1,20,22],[20,24,20,45],[30,0,30,45],[31,0,31,45],[28,0,28,45],[27,0,27,45],[24,0,24,45],[25,1,25,2],[25,3,25,45],[26,1,26,2],[26,3,26,45],[14,1,14,22],[14,24,14,45],[21,1,21,22],[21,24,21,45],[22,1,22,22],[22,24,22,45],[15,1,15,22],[15,24,15,45],[16,1,16,22],[16,24,16,45],[17,1,17,22],[17,24,17,45],[18,1,18,22],[18,24,18,45],[19,1,19,22],[19,24,19,45],[9,0,9,45],[10,0,10,45],[12,0,12,45],[13,1,13,22],[13,24,13,45],[0,0,0,45],[1,0,1,45],[2,0,2,22],[2,23,2,29],[2,30,2,45],[5,30,5,45],[5,47,6,48],[6,0,6,45],[7,0,7,45],[7,47,8,47],[7,48,8,48],[8,0,8,45],[3,0,5,22],[3,23,3,29],[3,30,4,45],[4,23,4,29],[5,23,5,29]]}
["Baccalauréat professionnel « maintenance des équipements industriels »"]
["Épreuve E32 (Unité U32) : INTERVENTION SUR UN EQUIPEMENT MECANIQUE"]
["Établissement : (tampon)",null,null,null,null,null,null,null,null,null,null,null,null,null,null,null,null,null,null,null,null,null,null,"Session : "]
[null,null,null,null,null,null,null,null,null,null,null,null,null,null,null,null,null,null,null,null,null,null,null,"Nom du candidat:"]
[null,null,null,null,null,null,null,null,null,null,null,null,null,null,null,null,null,null,null,null,null,null,null,"Prénom : "]
[null,null,null,null,null,null,null,null,null,null,null,null,null,null,null,null,null,null,null,null,null,null,null,"Date de l'évaluation:",null,null,null,null,null,null,null,null,null,null,null,null,null,null,null,null,null,null,null,null,null,null,null,"Situation d'évaluation :"]
["Lieu d’évaluation :"]
["      Etablissement",null,null,null,null,null,null,null,null,null,null,null,null,null,null,null,null,null,null,null,null,null,null,null,null,null,null,null,null,null,null,null,null,null,null,null,null,null,null,null,null,null,null,null,null,null,null,"E 32","F"]
["      Entreprise :       "]
["Description sommaire du travail demandé :"]
[]
[]
["Données fournies au candidat"]
["X","Le bien et les conditions de son environnement",null,null,null,null,null,null,null,null,null,null,null,null,null,null,null,null,null,null,null,null,null,"X","Les composants et les conditions de leur environnement"]
["X","Le dossier technique du bien et son dossier de maintenance  sur supports papiers ou supports numériques",null,null,null,null,null,null,null,null,null,null,null,null,null,null,null,null,null,null,null,null,null,"X","Toutes informations en provenance de l’utilisateur ou d’autres intervenants"]
["X","Les consignes d’exploitation",null,null,null,null,null,null,null,null,null,null,null,null,null,null,null,null,null,null,null,null,null,"X","Les pièces de rechange, les consommables"]
["X","Le bon de travail",null,null,null,null,null,null,null,null,null,null,null,null,null,null,null,null,null,null,null,null,null,"X","Les équipements de protection individuels et collectifs"]
["X","Le document unique d’évaluation des risques",null,null,null,null,null,null,null,null,null,null,null,null,null,null,null,null,null,null,null,null,null,"X","Les outillages, matériels de contrôle, de mesure, moyens de manutention."]
["X","Le carnet de prescription de sécurité électrique",null,null,null,null,null,null,null,null,null,null,null,null,null,null,null,null,null,null,null,null,null,"X","Toutes documentations techniques"]
["X","Les normes",null,null,null,null,null,null,null,null,null,null,null,null,null,null,null,null,null,null,null,null,null,"X","Les consignes et/ou procédures écrites"]
["X","Le plan d’implantation du bien",null,null,null,null,null,null,null,null,null,null,null,null,null,null,null,null,null,null,null,null,null,"X","Le plan de prévention"]
[]
[]
["     ÇRepérer les données fournies",null,null,null,null,null,null,null,null,null,null,null,null,null,null,null,null,null,null,null,null,null,null,null,"ÇRepérer les données fournies"]
["Travail demandé"]
["X","A1-T3",null,"Réaliser la maintenance corrective - Réaliser des réparations, des dépannages dans les domaines : mécanique, électrique, pneumatique, hydraulique."]
["X","A2-T2",null,"Réaliser la maintenance préventive - Réaliser des opérations planifiées."]
["L’ENSEMBLE DES ACTIVITES ET DES TACHES SONT MOBILISEES EN CE QUI CONCERNE LA COMPETENCE CP1.7 QUI A TRAIT A LA SECURITE ET A LA PREVENTION DES RISQUES"]
["Consulter le référentiel des activités professionnelles pour obtenir le détail des tâches."]
["Ç Repérer les tâches demandées (ce sont celles qui correspondent à l’unité dans le référentiel de certification, à l’exclusion de toute autre)"]
["Appréciation globale et proposition de note : "]
[]
["Noms et signatures des évaluateurs :\n\n\n",null,null,null,null,null,null,null,null,null,null,null,null,null,null,null,null,null,null,null,null,null,null,null,null,null,null,null,null,null,null,null,null,null,null,"Note proposée :          ",null,null,null,null,null,null,null,"/20"]
[null,null,null,null,null,null,null,null,null,null,null,null,null,null,null,null,null,null,null,null,null,null,null,null,null,null,null,null,null,null,null,null,null,null,null,"Note affectée de son coefficient :",null,null,null,null,null,null,null,"/60"]

{"sheet":"U32_G","index":31,"n_rows":34,"n_cols":49,"rows_kept":34,"cut":false,"hidden":true,"merged":[[32,0,33,34],[32,35,32,39],[32,40,32,42],[32,43,32,45],[33,35,33,39],[33,40,33,42],[33,43,33,45],[20,1,20,22],[20,24,20,45],[30,0,30,45],[31,0,31,45],[28,0,28,45],[27,0,27,45],[24,0,24,45],[25,1,25,2],[25,3,25,45],[26,1,26,2],[26,3,26,45],[14,1,14,22],[14,24,14,45],[21,1,21,22],[21,24,21,45],[22,1,22,22],[22,24,22,45],[15,1,15,22],[15,24,15,45],[16,1,16,22],[16,24,16,45],[17,1,17,22],[17,24,17,45],[18,1,18,22],[18,24,18,45],[19,1,19,22],[19,24,19,45],[9,0,9,45],[10,0,10,45],[12,0,12,45],[13,1,13,22],[13,24,13,45],[0,0,0,45],[1,0,1,45],[2,0,2,22],[2,23,2,29],[2,30,2,45],[5,30,5,45],[5,47,6,48],[6,0,6,45],[7,0,7,45],[7,47,8,47],[7,48,8,48],[8,0,8,45],[3,0,5,22],[3,23,3,29],[3,30,4,45],[4,23,4,29],[5,23,5,29]]}
["Baccalauréat professionnel « maintenance des équipements industriels »"]
["Épreuve E32 (Unité U32) : INTERVENTION SUR UN EQUIPEMENT MECANIQUE"]
["Établissement : (tampon)",null,null,null,null,null,null,null,null,null,null,null,null,null,null,null,null,null,null,null,null,null,null,"Session : "]
[null,null,null,null,null,null,null,null,null,null,null,null,null,null,null,null,null,null,null,null,null,null,null,"Nom du candidat:"]
[null,null,null,null,null,null,null,null,null,null,null,null,null,null,null,null,null,null,null,null,null,null,null,"Prénom : "]
[null,null,null,null,null,null,null,null,null,null,null,null,null,null,null,null,null,null,null,null,null,null,null,"Date de l'évaluation:",null,null,null,null,null,null,null,null,null,null,null,null,null,null,null,null,null,null,null,null,null,null,null,"Situation d'évaluation :"]
["Lieu d’évaluation :"]
["      Etablissement",null,null,null,null,null,null,null,null,null,null,null,null,null,null,null,null,null,null,null,null,null,null,null,null,null,null,null,null,null,null,null,null,null,null,null,null,null,null,null,null,null,null,null,null,null,null,"E 32","G"]
["      Entreprise :       "]
["Description sommaire du travail demandé :"]
[]
[]
["Données fournies au candidat"]
["X","Le bien et les conditions de son environnement",null,null,null,null,null,null,null,null,null,null,null,null,null,null,null,null,null,null,null,null,null,"X","Les composants et les conditions de leur environnement"]
["X","Le dossier technique du bien et son dossier de maintenance  sur supports papiers ou supports numériques",null,null,null,null,null,null,null,null,null,null,null,null,null,null,null,null,null,null,null,null,null,"X","Toutes informations en provenance de l’utilisateur ou d’autres intervenants"]
["X","Les consignes d’exploitation",null,null,null,null,null,null,null,null,null,null,null,null,null,null,null,null,null,null,null,null,null,"X","Les pièces de rechange, les consommables"]
["X","Le bon de travail",null,null,null,null,null,null,null,null,null,null,null,null,null,null,null,null,null,null,null,null,null,"X","Les équipements de protection individuels et collectifs"]
["X","Le document unique d’évaluation des risques",null,null,null,null,null,null,null,null,null,null,null,null,null,null,null,null,null,null,null,null,null,"X","Les outillages, matériels de contrôle, de mesure, moyens de manutention."]
["X","Le carnet de prescription de sécurité électrique",null,null,null,null,null,null,null,null,null,null,null,null,null,null,null,null,null,null,null,null,null,"X","Toutes documentations techniques"]
["X","Les normes",null,null,null,null,null,null,null,null,null,null,null,null,null,null,null,null,null,null,null,null,null,"X","Les consignes et/ou procédures écrites"]
["X","Le plan d’implantation du bien",null,null,null,null,null,null,null,null,null,null,null,null,null,null,null,null,null,null,null,null,null,"X","Le plan de prévention"]
[]
[]
["     ÇRepérer les données fournies",null,null,null,null,null,null,null,null,null,null,null,null,null,null,null,null,null,null,null,null,null,null,null,"ÇRepérer les données fournies"]
["Travail demandé"]
["X","A1-T3",null,"Réaliser la maintenance corrective - Réaliser des réparations, des dépannages dans les domaines : mécanique, électrique, pneumatique, hydraulique."]
["X","A2-T2",null,"Réaliser la maintenance préventive - Réaliser des opérations planifiées."]
["L’ENSEMBLE DES ACTIVITES ET DES TACHES SONT MOBILISEES EN CE QUI CONCERNE LA COMPETENCE CP1.7 QUI A TRAIT A LA SECURITE ET A LA PREVENTION DES RISQUES"]
["Consulter le référentiel des activités professionnelles pour obtenir le détail des tâches."]
["Ç Repérer les tâches demandées (ce sont celles qui correspondent à l’unité dans le référentiel de certification, à l’exclusion de toute autre)"]
["Appréciation globale et proposition de note : "]
[]
["Noms et signatures des évaluateurs :\n\n\n",null,null,null,null,null,null,null,null,null,null,null,null,null,null,null,null,null,null,null,null,null,null,null,null,null,null,null,null,null,null,null,null,null,null,"Note proposée :          ",null,null,null,null,null,null,null,"/20"]
[null,null,null,null,null,null,null,null,null,null,null,null,null,null,null,null,null,null,null,null,null,null,null,null,null,null,null,null,null,null,null,null,null,null,null,"Note affectée de son coefficient :",null,null,null,null,null,null,null,"/60"]

{"sheet":"U32_H","index":32,"n_rows":34,"n_cols":49,"rows_kept":34,"cut":false,"hidden":true,"merged":[[32,0,33,34],[32,35,32,39],[32,40,32,42],[32,43,32,45],[33,35,33,39],[33,40,33,42],[33,43,33,45],[20,1,20,22],[20,24,20,45],[30,0,30,45],[31,0,31,45],[28,0,28,45],[27,0,27,45],[24,0,24,45],[25,1,25,2],[25,3,25,45],[26,1,26,2],[26,3,26,45],[14,1,14,22],[14,24,14,45],[21,1,21,22],[21,24,21,45],[22,1,22,22],[22,24,22,45],[15,1,15,22],[15,24,15,45],[16,1,16,22],[16,24,16,45],[17,1,17,22],[17,24,17,45],[18,1,18,22],[18,24,18,45],[19,1,19,22],[19,24,19,45],[9,0,9,45],[10,0,10,45],[12,0,12,45],[13,1,13,22],[13,24,13,45],[0,0,0,45],[1,0,1,45],[2,0,2,22],[2,23,2,29],[2,30,2,45],[5,30,5,45],[5,47,6,48],[6,0,6,45],[7,0,7,45],[7,47,8,47],[7,48,8,48],[8,0,8,45],[3,0,5,22],[3,23,3,29],[3,30,4,45],[4,23,4,29],[5,23,5,29]]}
["Baccalauréat professionnel « maintenance des équipements industriels »"]
["Épreuve E32 (Unité U32) : INTERVENTION SUR UN EQUIPEMENT MECANIQUE"]
["Établissement : (tampon)",null,null,null,null,null,null,null,null,null,null,null,null,null,null,null,null,null,null,null,null,null,null,"Session : "]
[null,null,null,null,null,null,null,null,null,null,null,null,null,null,null,null,null,null,null,null,null,null,null,"Nom du candidat:"]
[null,null,null,null,null,null,null,null,null,null,null,null,null,null,null,null,null,null,null,null,null,null,null,"Prénom : "]
[null,null,null,null,null,null,null,null,null,null,null,null,null,null,null,null,null,null,null,null,null,null,null,"Date de l'évaluation:",null,null,null,null,null,null,null,null,null,null,null,null,null,null,null,null,null,null,null,null,null,null,null,"Situation d'évaluation :"]
["Lieu d’évaluation :"]
["      Etablissement",null,null,null,null,null,null,null,null,null,null,null,null,null,null,null,null,null,null,null,null,null,null,null,null,null,null,null,null,null,null,null,null,null,null,null,null,null,null,null,null,null,null,null,null,null,null,"E 32","H"]
["      Entreprise :       "]
["Description sommaire du travail demandé :"]
[]
[]
["Données fournies au candidat"]
["X","Le bien et les conditions de son environnement",null,null,null,null,null,null,null,null,null,null,null,null,null,null,null,null,null,null,null,null,null,"X","Les composants et les conditions de leur environnement"]
["X","Le dossier technique du bien et son dossier de maintenance  sur supports papiers ou supports numériques",null,null,null,null,null,null,null,null,null,null,null,null,null,null,null,null,null,null,null,null,null,"X","Toutes informations en provenance de l’utilisateur ou d’autres intervenants"]
["X","Les consignes d’exploitation",null,null,null,null,null,null,null,null,null,null,null,null,null,null,null,null,null,null,null,null,null,"X","Les pièces de rechange, les consommables"]
["X","Le bon de travail",null,null,null,null,null,null,null,null,null,null,null,null,null,null,null,null,null,null,null,null,null,"X","Les équipements de protection individuels et collectifs"]
["X","Le document unique d’évaluation des risques",null,null,null,null,null,null,null,null,null,null,null,null,null,null,null,null,null,null,null,null,null,"X","Les outillages, matériels de contrôle, de mesure, moyens de manutention."]
["X","Le carnet de prescription de sécurité électrique",null,null,null,null,null,null,null,null,null,null,null,null,null,null,null,null,null,null,null,null,null,"X","Toutes documentations techniques"]
["X","Les normes",null,null,null,null,null,null,null,null,null,null,null,null,null,null,null,null,null,null,null,null,null,"X","Les consignes et/ou procédures écrites"]
["X","Le plan d’implantation du bien",null,null,null,null,null,null,null,null,null,null,null,null,null,null,null,null,null,null,null,null,null,"X","Le plan de prévention"]
[]
[]
["     ÇRepérer les données fournies",null,null,null,null,null,null,null,null,null,null,null,null,null,null,null,null,null,null,null,null,null,null,null,"ÇRepérer les données fournies"]
["Travail demandé"]
["X","A1-T3",null,"Réaliser la maintenance corrective - Réaliser des réparations, des dépannages dans les domaines : mécanique, électrique, pneumatique, hydraulique."]
["X","A2-T2",null,"Réaliser la maintenance préventive - Réaliser des opérations planifiées."]
["L’ENSEMBLE DES ACTIVITES ET DES TACHES SONT MOBILISEES EN CE QUI CONCERNE LA COMPETENCE CP1.7 QUI A TRAIT A LA SECURITE ET A LA PREVENTION DES RISQUES"]
["Consulter le référentiel des activités professionnelles pour obtenir le détail des tâches."]
["Ç Repérer les tâches demandées (ce sont celles qui correspondent à l’unité dans le référentiel de certification, à l’exclusion de toute autre)"]
["Appréciation globale et proposition de note : "]
[]
["Noms et signatures des évaluateurs :\n\n\n",null,null,null,null,null,null,null,null,null,null,null,null,null,null,null,null,null,null,null,null,null,null,null,null,null,null,null,null,null,null,null,null,null,null,"Note proposée :          ",null,null,null,null,null,null,null,"/20"]
[null,null,null,null,null,null,null,null,null,null,null,null,null,null,null,null,null,null,null,null,null,null,null,null,null,null,null,null,null,null,null,null,null,null,null,"Note affectée de son coefficient :",null,null,null,null,null,null,null,"/60"]

{"sheet":"U33_A","index":33,"n_rows":40,"n_cols":49,"rows_kept":40,"cut":false,"hidden":true,"merged":[[33,0,33,45],[28,3,28,45],[29,3,29,45],[30,3,30,45],[31,3,31,45],[32,3,32,45],[32,1,32,2],[31,1,31,2],[30,1,30,2],[5,47,6,48],[7,47,8,47],[7,48,8,48],[5,30,5,45],[6,0,6,45],[7,0,7,45],[8,0,8,45],[3,0,5,22],[3,23,3,29],[3,30,4,45],[4,23,4,29],[5,23,5,29],[9,0,9,45],[10,0,10,45],[16,1,16,22],[16,24,16,45],[17,1,17,22],[17,24,17,45],[18,1,18,22],[18,24,18,45],[12,0,12,45],[13,1,13,22],[13,24,13,45],[14,1,14,22],[14,24,14,45],[15,1,15,22],[15,24,15,45],[0,0,0,45],[1,0,1,45],[2,0,2,22],[2,23,2,29],[2,30,2,45],[19,1,19,22],[19,24,19,45],[20,1,20,22],[20,24,20,45],[21,1,21,22],[21,24,21,45],[22,1,22,22],[22,24,22,45],[23,1,23,22],[23,24,23,45],[24,1,24,22],[24,24,24,45],[25,1,25,22],[25,24,25,45],[27,0,27,45],[28,1,28,2],[29,1,29,2],[40,0,42,45],[34,0,34,45],[36,0,36,45],[37,0,37,45],[38,0,39,34],[38,35,38,39],[38,40,38,42],[38,43,38,45],[39,35,39,39],[39,40,39,42],[39,43,39,45]]}
["Baccalauréat professionnel « maintenance des équipements industriels »"]
["Épreuve E33 (Unité U33) : Maintenance d’un système automatisé"]
["Établissement : (tampon)",null,null,null,null,null,null,null,null,null,null,null,null,null,null,null,null,null,null,null,null,null,null,"Session : "]
[null,null,null,null,null,null,null,null,null,null,null,null,null,null,null,null,null,null,null,null,null,null,null,"Nom du candidat:"]
[null,null,null,null,null,null,null,null,null,null,null,null,null,null,null,null,null,null,null,null,null,null,null,"Prénom : "]
[null,null,null,null,null,null,null,null,null,null,null,null,null,null,null,null,null,null,null,null,null,null,null,"Date de l'évaluation:",null,null,null,null,null,null,null,null,null,null,null,null,null,null,null,null,null,null,null,null,null,null,null,"Situation d'évaluation :"]
["Lieu d’évaluation :"]
["      Etablissement",null,null,null,null,null,null,null,null,null,null,null,null,null,null,null,null,null,null,null,null,null,null,null,null,null,null,null,null,null,null,null,null,null,null,null,null,null,null,null,null,null,null,null,null,null,null,"E 33","A"]
["      Entreprise :       "]
["Description sommaire du travail demandé :"]
[]
[]
["Données fournies au candidat"]
["X","Un bien en panne totale ou partielle.",null,null,null,null,null,null,null,null,null,null,null,null,null,null,null,null,null,null,null,null,null,"X","Le bon de travail."]
["X","Le dossier technique du bien et son dossier de maintenance sur supports papiers ou supports numériques",null,null,null,null,null,null,null,null,null,null,null,null,null,null,null,null,null,null,null,null,null,"X","Toutes informations en provenance de l’utilisateur ou d’autres intervenants"]
["X","Les Consignes et/ou les procédures écrites",null,null,null,null,null,null,null,null,null,null,null,null,null,null,null,null,null,null,null,null,null,"X","La description des évènements par l’exploitant"]
["X","Le dossier historique du bien.",null,null,null,null,null,null,null,null,null,null,null,null,null,null,null,null,null,null,null,null,null,"X","La documentation technique du bien."]
["X","Document unique d’évaluation des risques",null,null,null,null,null,null,null,null,null,null,null,null,null,null,null,null,null,null,null,null,null,"X","Le plan de prévention"]
["X"," Eventuellement une aide au diagnostic :\n- Tableau cause/effet\n- Organigramme de défaillance\n- Diagramme cause/effet – AMPEC, - AMDE…\n",null,null,null,null,null,null,null,null,null,null,null,null,null,null,null,null,null,null,null,null,null,"X","Les moyens d’investigation :\nConsole de programmation maintenance.\nLes appareils de mesure, de contrôle, moyens de manutention.\n"]
["X","Les outillages nécessaires.",null,null,null,null,null,null,null,null,null,null,null,null,null,null,null,null,null,null,null,null,null,"X","Les  documentations constructeur spécifiques"]
["X","Les pièces de rechange, consommables",null,null,null,null,null,null,null,null,null,null,null,null,null,null,null,null,null,null,null,null,null,"X","Le plan d’implantation du bien"]
["X","Les équipements de protection individuels et collectifs",null,null,null,null,null,null,null,null,null,null,null,null,null,null,null,null,null,null,null,null,null,"X","Les équipements individuels de sécurité"]
["X","Le planning des interventions",null,null,null,null,null,null,null,null,null,null,null,null,null,null,null,null,null,null,null,null,null,"X","Les documents utilisateurs du ou des postes de travail."]
["X","Le dossier de préparation",null,null,null,null,null,null,null,null,null,null,null,null,null,null,null,null,null,null,null,null,null,"X","Le document de recette"]
["X","Les normes",null,null,null,null,null,null,null,null,null,null,null,null,null,null,null,null,null,null,null,null,null,"X","Le plan de prévention"]
["X","Le Carnet de prescription de sécurité électrique"]
["     ÇRepérer les données fournies",null,null,null,null,null,null,null,null,null,null,null,null,null,null,null,null,null,null,null,null,null,null,null,"ÇRepérer les données fournies"]
["Travail demandé"]
["X","A1-T1",null,"Réaliser la maintenance corrective - Diagnostiquer les pannes."]
["X","A1-T3",null,"Réaliser la maintenance corrective - Réaliser des réparations, des dépannages dans les domaines : mécanique, électrique, pneumatique, hydraulique. "]
["X","A2-T2",null,"Réaliser la maintenance préventive - Réaliser des opérations planifiées."]
["X","A4-T1",null,"Intégrer de nouveaux biens - Installer de nouveaux biens."]
["X","A4-T2",null,"Intégrer de nouveaux biens - Mettre en service de nouveaux biens"]
["L’ENSEMBLE DES ACTIVITES ET DES TACHES SONT MOBILISEES EN CE QUI CONCERNE LA COMPETENCE CP1.7 QUI A TRAIT A LA SECURITE ET A LA PREVENTION DES RISQUES"]
["Consulter le référentiel des activités professionnelles pour obtenir le détail des tâches."]
["Ç Repérer les tâches demandées (ce sont celles qui correspondent à l’unité dans le référentiel de certification, à l’exclusion de toute autre)"]
["Appréciation globale et proposition de note : "]
[]
["Noms et signatures des évaluateurs :\n\n\n",null,null,null,null,null,null,null,null,null,null,null,null,null,null,null,null,null,null,null,null,null,null,null,null,null,null,null,null,null,null,null,null,null,null,"Note proposée :          ",null,null,null,null,null,null,null,"/20"]
[null,null,null,null,null,null,null,null,null,null,null,null,null,null,null,null,null,null,null,null,null,null,null,null,null,null,null,null,null,null,null,null,null,null,null,"Note affectée de son coefficient :",null,null,null,null,null,null,null,"/60"]

{"sheet":"U33_B","index":34,"n_rows":40,"n_cols":49,"rows_kept":40,"cut":false,"hidden":true,"merged":[[39,35,39,39],[39,40,39,42],[39,43,39,45],[28,3,28,45],[29,3,29,45],[30,3,30,45],[31,3,31,45],[32,3,32,45],[37,0,37,45],[36,0,36,45],[38,0,39,34],[38,35,38,39],[38,40,38,42],[38,43,38,45],[31,1,31,2],[32,1,32,2],[33,0,33,45],[34,0,34,45],[28,1,28,2],[29,1,29,2],[30,1,30,2],[24,1,24,22],[24,24,24,45],[25,1,25,22],[25,24,25,45],[27,0,27,45],[23,1,23,22],[23,24,23,45],[18,1,18,22],[18,24,18,45],[19,1,19,22],[19,24,19,45],[20,1,20,22],[20,24,20,45],[14,1,14,22],[14,24,14,45],[21,1,21,22],[21,24,21,45],[22,1,22,22],[22,24,22,45],[15,1,15,22],[15,24,15,45],[16,1,16,22],[16,24,16,45],[17,1,17,22],[17,24,17,45],[9,0,9,45],[10,0,10,45],[12,0,12,45],[13,1,13,22],[13,24,13,45],[0,0,0,45],[1,0,1,45],[2,0,2,22],[2,23,2,29],[2,30,2,45],[5,30,5,45],[5,47,6,48],[6,0,6,45],[7,0,7,45],[7,47,8,47],[7,48,8,48],[8,0,8,45],[3,0,5,22],[3,23,3,29],[3,30,4,45],[4,23,4,29],[5,23,5,29]]}
["Baccalauréat professionnel « maintenance des équipements industriels »"]
["Épreuve E33 (Unité U33) : Maintenance d’un système automatisé"]
["Établissement : (tampon)",null,null,null,null,null,null,null,null,null,null,null,null,null,null,null,null,null,null,null,null,null,null,"Session : "]
[null,null,null,null,null,null,null,null,null,null,null,null,null,null,null,null,null,null,null,null,null,null,null,"Nom du candidat:"]
[null,null,null,null,null,null,null,null,null,null,null,null,null,null,null,null,null,null,null,null,null,null,null,"Prénom : "]
[null,null,null,null,null,null,null,null,null,null,null,null,null,null,null,null,null,null,null,null,null,null,null,"Date de l'évaluation:",null,null,null,null,null,null,null,null,null,null,null,null,null,null,null,null,null,null,null,null,null,null,null,"Situation d'évaluation :"]
["Lieu d’évaluation :"]
["      Etablissement",null,null,null,null,null,null,null,null,null,null,null,null,null,null,null,null,null,null,null,null,null,null,null,null,null,null,null,null,null,null,null,null,null,null,null,null,null,null,null,null,null,null,null,null,null,null,"E 33","B"]
["      Entreprise :       "]
["Description sommaire du travail demandé :"]
[]
[]
["Données fournies au candidat"]
["X","Un bien en panne totale ou partielle.",null,null,null,null,null,null,null,null,null,null,null,null,null,null,null,null,null,null,null,null,null,"X","Le bon de travail."]
["X","Le dossier technique du bien et son dossier de maintenance sur supports papiers ou supports numériques",null,null,null,null,null,null,null,null,null,null,null,null,null,null,null,null,null,null,null,null,null,"X","Toutes informations en provenance de l’utilisateur ou d’autres intervenants"]
["X","Les Consignes et/ou les procédures écrites",null,null,null,null,null,null,null,null,null,null,null,null,null,null,null,null,null,null,null,null,null,"X","La description des évènements par l’exploitant"]
["X","Le dossier historique du bien.",null,null,null,null,null,null,null,null,null,null,null,null,null,null,null,null,null,null,null,null,null,"X","La documentation technique du bien."]
["X","Document unique d’évaluation des risques",null,null,null,null,null,null,null,null,null,null,null,null,null,null,null,null,null,null,null,null,null,"X","Le plan de prévention"]
["X"," Eventuellement une aide au diagnostic :\n- Tableau cause/effet\n- Organigramme de défaillance\n- Diagramme cause/effet – AMPEC, - AMDE…\n",null,null,null,null,null,null,null,null,null,null,null,null,null,null,null,null,null,null,null,null,null,"X","Les moyens d’investigation :\nConsole de programmation maintenance.\nLes appareils de mesure, de contrôle, moyens de manutention.\n"]
["X","Les outillages nécessaires.",null,null,null,null,null,null,null,null,null,null,null,null,null,null,null,null,null,null,null,null,null,"X","Les  documentations constructeur spécifiques"]
["X","Les pièces de rechange, consommables",null,null,null,null,null,null,null,null,null,null,null,null,null,null,null,null,null,null,null,null,null,"X","Le plan d’implantation du bien"]
["X","Les équipements de protection individuels et collectifs",null,null,null,null,null,null,null,null,null,null,null,null,null,null,null,null,null,null,null,null,null,"X","Les équipements individuels de sécurité"]
["X","Le planning des interventions",null,null,null,null,null,null,null,null,null,null,null,null,null,null,null,null,null,null,null,null,null,"X","Les documents utilisateurs du ou des postes de travail."]
["X","Le dossier de préparation",null,null,null,null,null,null,null,null,null,null,null,null,null,null,null,null,null,null,null,null,null,"X","Le document de recette"]
["X","Les normes",null,null,null,null,null,null,null,null,null,null,null,null,null,null,null,null,null,null,null,null,null,"X","Le plan de prévention"]
["X","Le Carnet de prescription de sécurité électrique"]
["     ÇRepérer les données fournies",null,null,null,null,null,null,null,null,null,null,null,null,null,null,null,null,null,null,null,null,null,null,null,"ÇRepérer les données fournies"]
["Travail demandé"]
["X","A1-T1",null,"Réaliser la maintenance corrective - Diagnostiquer les pannes."]
["X","A1-T3",null,"Réaliser la maintenance corrective - Réaliser des réparations, des dépannages dans les domaines : mécanique, électrique, pneumatique, hydraulique. "]
["X","A2-T2",null,"Réaliser la maintenance préventive - Réaliser des opérations planifiées."]
["X","A4-T1",null,"Intégrer de nouveaux biens - Installer de nouveaux biens."]
["X","A4-T2",null,"Intégrer de nouveaux biens - Mettre en service de nouveaux biens"]
["L’ENSEMBLE DES ACTIVITES ET DES TACHES SONT MOBILISEES EN CE QUI CONCERNE LA COMPETENCE CP1.7 QUI A TRAIT A LA SECURITE ET A LA PREVENTION DES RISQUES"]
["Consulter le référentiel des activités professionnelles pour obtenir le détail des tâches."]
["Ç Repérer les tâches demandées (ce sont celles qui correspondent à l’unité dans le référentiel de certification, à l’exclusion de toute autre)"]
["Appréciation globale et proposition de note : "]
[]
["Noms et signatures des évaluateurs :\n\n\n",null,null,null,null,null,null,null,null,null,null,null,null,null,null,null,null,null,null,null,null,null,null,null,null,null,null,null,null,null,null,null,null,null,null,"Note proposée :          ",null,null,null,null,null,null,null,"/20"]
[null,null,null,null,null,null,null,null,null,null,null,null,null,null,null,null,null,null,null,null,null,null,null,null,null,null,null,null,null,null,null,null,null,null,null,"Note affectée de son coefficient :",null,null,null,null,null,null,null,"/60"]

{"sheet":"U33_C","index":35,"n_rows":40,"n_cols":49,"rows_kept":40,"cut":false,"hidden":true,"merged":[[39,35,39,39],[39,40,39,42],[39,43,39,45],[28,3,28,45],[29,3,29,45],[30,3,30,45],[31,3,31,45],[32,3,32,45],[37,0,37,45],[36,0,36,45],[38,0,39,34],[38,35,38,39],[38,40,38,42],[38,43,38,45],[31,1,31,2],[32,1,32,2],[33,0,33,45],[34,0,34,45],[28,1,28,2],[29,1,29,2],[30,1,30,2],[24,1,24,22],[24,24,24,45],[25,1,25,22],[25,24,25,45],[27,0,27,45],[23,1,23,22],[23,24,23,45],[18,1,18,22],[18,24,18,45],[19,1,19,22],[19,24,19,45],[20,1,20,22],[20,24,20,45],[14,1,14,22],[14,24,14,45],[21,1,21,22],[21,24,21,45],[22,1,22,22],[22,24,22,45],[15,1,15,22],[15,24,15,45],[16,1,16,22],[16,24,16,45],[17,1,17,22],[17,24,17,45],[9,0,9,45],[10,0,10,45],[12,0,12,45],[13,1,13,22],[13,24,13,45],[0,0,0,45],[1,0,1,45],[2,0,2,22],[2,23,2,29],[2,30,2,45],[5,30,5,45],[5,47,6,48],[6,0,6,45],[7,0,7,45],[7,47,8,47],[7,48,8,48],[8,0,8,45],[3,0,5,22],[3,23,3,29],[3,30,4,45],[4,23,4,29],[5,23,5,29]]}
["Baccalauréat professionnel « maintenance des équipements industriels »"]
["Épreuve E33 (Unité U33) : Maintenance d’un système automatisé"]
["Établissement : (tampon)",null,null,null,null,null,null,null,null,null,null,null,null,null,null,null,null,null,null,null,null,null,null,"Session : "]
[null,null,null,null,null,null,null,null,null,null,null,null,null,null,null,null,null,null,null,null,null,null,null,"Nom du candidat:"]
[null,null,null,null,null,null,null,null,null,null,null,null,null,null,null,null,null,null,null,null,null,null,null,"Prénom : "]
[null,null,null,null,null,null,null,null,null,null,null,null,null,null,null,null,null,null,null,null,null,null,null,"Date de l'évaluation:",null,null,null,null,null,null,null,null,null,null,null,null,null,null,null,null,null,null,null,null,null,null,null,"Situation d'évaluation :"]
["Lieu d’évaluation :"]
["      Etablissement",null,null,null,null,null,null,null,null,null,null,null,null,null,null,null,null,null,null,null,null,null,null,null,null,null,null,null,null,null,null,null,null,null,null,null,null,null,null,null,null,null,null,null,null,null,null,"E 33","C"]
["      Entreprise :       "]
["Description sommaire du travail demandé :"]
[]
[]
["Données fournies au candidat"]
["X","Un bien en panne totale ou partielle.",null,null,null,null,null,null,null,null,null,null,null,null,null,null,null,null,null,null,null,null,null,"X","Le bon de travail."]
["X","Le dossier technique du bien et son dossier de maintenance sur supports papiers ou supports numériques",null,null,null,null,null,null,null,null,null,null,null,null,null,null,null,null,null,null,null,null,null,"X","Toutes informations en provenance de l’utilisateur ou d’autres intervenants"]
["X","Les Consignes et/ou les procédures écrites",null,null,null,null,null,null,null,null,null,null,null,null,null,null,null,null,null,null,null,null,null,"X","La description des évènements par l’exploitant"]
["X","Le dossier historique du bien.",null,null,null,null,null,null,null,null,null,null,null,null,null,null,null,null,null,null,null,null,null,"X","La documentation technique du bien."]
["X","Document unique d’évaluation des risques",null,null,null,null,null,null,null,null,null,null,null,null,null,null,null,null,null,null,null,null,null,"X","Le plan de prévention"]
["X"," Eventuellement une aide au diagnostic :\n- Tableau cause/effet\n- Organigramme de défaillance\n- Diagramme cause/effet – AMPEC, - AMDE…\n",null,null,null,null,null,null,null,null,null,null,null,null,null,null,null,null,null,null,null,null,null,"X","Les moyens d’investigation :\nConsole de programmation maintenance.\nLes appareils de mesure, de contrôle, moyens de manutention.\n"]
["X","Les outillages nécessaires.",null,null,null,null,null,null,null,null,null,null,null,null,null,null,null,null,null,null,null,null,null,"X","Les  documentations constructeur spécifiques"]
["X","Les pièces de rechange, consommables",null,null,null,null,null,null,null,null,null,null,null,null,null,null,null,null,null,null,null,null,null,"X","Le plan d’implantation du bien"]
["X","Les équipements de protection individuels et collectifs",null,null,null,null,null,null,null,null,null,null,null,null,null,null,null,null,null,null,null,null,null,"X","Les équipements individuels de sécurité"]
["X","Le planning des interventions",null,null,null,null,null,null,null,null,null,null,null,null,null,null,null,null,null,null,null,null,null,"X","Les documents utilisateurs du ou des postes de travail."]
["X","Le dossier de préparation",null,null,null,null,null,null,null,null,null,null,null,null,null,null,null,null,null,null,null,null,null,"X","Le document de recette"]
["X","Les normes",null,null,null,null,null,null,null,null,null,null,null,null,null,null,null,null,null,null,null,null,null,"X","Le plan de prévention"]
["X","Le Carnet de prescription de sécurité électrique"]
["     ÇRepérer les données fournies",null,null,null,null,null,null,null,null,null,null,null,null,null,null,null,null,null,null,null,null,null,null,null,"ÇRepérer les données fournies"]
["Travail demandé"]
["X","A1-T1",null,"Réaliser la maintenance corrective - Diagnostiquer les pannes."]
["X","A1-T3",null,"Réaliser la maintenance corrective - Réaliser des réparations, des dépannages dans les domaines : mécanique, électrique, pneumatique, hydraulique. "]
["X","A2-T2",null,"Réaliser la maintenance préventive - Réaliser des opérations planifiées."]
["X","A4-T1",null,"Intégrer de nouveaux biens - Installer de nouveaux biens."]
["X","A4-T2",null,"Intégrer de nouveaux biens - Mettre en service de nouveaux biens"]
["L’ENSEMBLE DES ACTIVITES ET DES TACHES SONT MOBILISEES EN CE QUI CONCERNE LA COMPETENCE CP1.7 QUI A TRAIT A LA SECURITE ET A LA PREVENTION DES RISQUES"]
["Consulter le référentiel des activités professionnelles pour obtenir le détail des tâches."]
["Ç Repérer les tâches demandées (ce sont celles qui correspondent à l’unité dans le référentiel de certification, à l’exclusion de toute autre)"]
["Appréciation globale et proposition de note : "]
[]
["Noms et signatures des évaluateurs :\n\n\n",null,null,null,null,null,null,null,null,null,null,null,null,null,null,null,null,null,null,null,null,null,null,null,null,null,null,null,null,null,null,null,null,null,null,"Note proposée :          ",null,null,null,null,null,null,null,"/20"]
[null,null,null,null,null,null,null,null,null,null,null,null,null,null,null,null,null,null,null,null,null,null,null,null,null,null,null,null,null,null,null,null,null,null,null,"Note affectée de son coefficient :",null,null,null,null,null,null,null,"/60"]

{"sheet":"U33_D","index":36,"n_rows":40,"n_cols":49,"rows_kept":40,"cut":false,"hidden":true,"merged":[[39,35,39,39],[39,40,39,42],[39,43,39,45],[28,3,28,45],[29,3,29,45],[30,3,30,45],[31,3,31,45],[32,3,32,45],[37,0,37,45],[36,0,36,45],[38,0,39,34],[38,35,38,39],[38,40,38,42],[38,43,38,45],[31,1,31,2],[32,1,32,2],[33,0,33,45],[34,0,34,45],[28,1,28,2],[29,1,29,2],[30,1,30,2],[24,1,24,22],[24,24,24,45],[25,1,25,22],[25,24,25,45],[27,0,27,45],[23,1,23,22],[23,24,23,45],[18,1,18,22],[18,24,18,45],[19,1,19,22],[19,24,19,45],[20,1,20,22],[20,24,20,45],[14,1,14,22],[14,24,14,45],[21,1,21,22],[21,24,21,45],[22,1,22,22],[22,24,22,45],[15,1,15,22],[15,24,15,45],[16,1,16,22],[16,24,16,45],[17,1,17,22],[17,24,17,45],[9,0,9,45],[10,0,10,45],[12,0,12,45],[13,1,13,22],[13,24,13,45],[0,0,0,45],[1,0,1,45],[2,0,2,22],[2,23,2,29],[2,30,2,45],[5,30,5,45],[5,47,6,48],[6,0,6,45],[7,0,7,45],[7,47,8,47],[7,48,8,48],[8,0,8,45],[3,0,5,22],[3,23,3,29],[3,30,4,45],[4,23,4,29],[5,23,5,29]]}
["Baccalauréat professionnel « maintenance des équipements industriels »"]
["Épreuve E33 (Unité U33) : Maintenance d’un système automatisé"]
["Établissement : (tampon)",null,null,null,null,null,null,null,null,null,null,null,null,null,null,null,null,null,null,null,null,null,null,"Session : "]
[null,null,null,null,null,null,null,null,null,null,null,null,null,null,null,null,null,null,null,null,null,null,null,"Nom du candidat:"]
[null,null,null,null,null,null,null,null,null,null,null,null,null,null,null,null,null,null,null,null,null,null,null,"Prénom : "]
[null,null,null,null,null,null,null,null,null,null,null,null,null,null,null,null,null,null,null,null,null,null,null,"Date de l'évaluation:",null,null,null,null,null,null,null,null,null,null,null,null,null,null,null,null,null,null,null,null,null,null,null,"Situation d'évaluation :"]
["Lieu d’évaluation :"]
["      Etablissement",null,null,null,null,null,null,null,null,null,null,null,null,null,null,null,null,null,null,null,null,null,null,null,null,null,null,null,null,null,null,null,null,null,null,null,null,null,null,null,null,null,null,null,null,null,null,"E 33","D"]
["      Entreprise :       "]
["Description sommaire du travail demandé :"]
[]
[]
["Données fournies au candidat"]
["X","Un bien en panne totale ou partielle.",null,null,null,null,null,null,null,null,null,null,null,null,null,null,null,null,null,null,null,null,null,"X","Le bon de travail."]
["X","Le dossier technique du bien et son dossier de maintenance sur supports papiers ou supports numériques",null,null,null,null,null,null,null,null,null,null,null,null,null,null,null,null,null,null,null,null,null,"X","Toutes informations en provenance de l’utilisateur ou d’autres intervenants"]
["X","Les Consignes et/ou les procédures écrites",null,null,null,null,null,null,null,null,null,null,null,null,null,null,null,null,null,null,null,null,null,"X","La description des évènements par l’exploitant"]
["X","Le dossier historique du bien.",null,null,null,null,null,null,null,null,null,null,null,null,null,null,null,null,null,null,null,null,null,"X","La documentation technique du bien."]
["X","Document unique d’évaluation des risques",null,null,null,null,null,null,null,null,null,null,null,null,null,null,null,null,null,null,null,null,null,"X","Le plan de prévention"]
["X"," Eventuellement une aide au diagnostic :\n- Tableau cause/effet\n- Organigramme de défaillance\n- Diagramme cause/effet – AMPEC, - AMDE…\n",null,null,null,null,null,null,null,null,null,null,null,null,null,null,null,null,null,null,null,null,null,"X","Les moyens d’investigation :\nConsole de programmation maintenance.\nLes appareils de mesure, de contrôle, moyens de manutention.\n"]
["X","Les outillages nécessaires.",null,null,null,null,null,null,null,null,null,null,null,null,null,null,null,null,null,null,null,null,null,"X","Les  documentations constructeur spécifiques"]
["X","Les pièces de rechange, consommables",null,null,null,null,null,null,null,null,null,null,null,null,null,null,null,null,null,null,null,null,null,"X","Le plan d’implantation du bien"]
["X","Les équipements de protection individuels et collectifs",null,null,null,null,null,null,null,null,null,null,null,null,null,null,null,null,null,null,null,null,null,"X","Les équipements individuels de sécurité"]
["X","Le planning des interventions",null,null,null,null,null,null,null,null,null,null,null,null,null,null,null,null,null,null,null,null,null,"X","Les documents utilisateurs du ou des postes de travail."]
["X","Le dossier de préparation",null,null,null,null,null,null,null,null,null,null,null,null,null,null,null,null,null,null,null,null,null,"X","Le document de recette"]
["X","Les normes",null,null,null,null,null,null,null,null,null,null,null,null,null,null,null,null,null,null,null,null,null,"X","Le plan de prévention"]
["X","Le Carnet de prescription de sécurité électrique"]
["     ÇRepérer les données fournies",null,null,null,null,null,null,null,null,null,null,null,null,null,null,null,null,null,null,null,null,null,null,null,"ÇRepérer les données fournies"]
["Travail demandé"]
["X","A1-T1",null,"Réaliser la maintenance corrective - Diagnostiquer les pannes."]
["X","A1-T3",null,"Réaliser la maintenance corrective - Réaliser des réparations, des dépannages dans les domaines : mécanique, électrique, pneumatique, hydraulique. "]
["X","A2-T2",null,"Réaliser la maintenance préventive - Réaliser des opérations planifiées."]
["X","A4-T1",null,"Intégrer de nouveaux biens - Installer de nouveaux biens."]
["X","A4-T2",null,"Intégrer de nouveaux biens - Mettre en service de nouveaux biens"]
["L’ENSEMBLE DES ACTIVITES ET DES TACHES SONT MOBILISEES EN CE QUI CONCERNE LA COMPETENCE CP1.7 QUI A TRAIT A LA SECURITE ET A LA PREVENTION DES RISQUES"]
["Consulter le référentiel des activités professionnelles pour obtenir le détail des tâches."]
["Ç Repérer les tâches demandées (ce sont celles qui correspondent à l’unité dans le référentiel de certification, à l’exclusion de toute autre)"]
["Appréciation globale et proposition de note : "]
[]
["Noms et signatures des évaluateurs :\n\n\n",null,null,null,null,null,null,null,null,null,null,null,null,null,null,null,null,null,null,null,null,null,null,null,null,null,null,null,null,null,null,null,null,null,null,"Note proposée :          ",null,null,null,null,null,null,null,"/20"]
[null,null,null,null,null,null,null,null,null,null,null,null,null,null,null,null,null,null,null,null,null,null,null,null,null,null,null,null,null,null,null,null,null,null,null,"Note affectée de son coefficient :",null,null,null,null,null,null,null,"/60"]

{"sheet":"U33_E","index":37,"n_rows":40,"n_cols":49,"rows_kept":40,"cut":false,"hidden":true,"merged":[[36,0,36,45],[37,0,37,45],[38,0,39,34],[38,35,38,39],[38,40,38,42],[38,43,38,45],[39,35,39,39],[39,40,39,42],[39,43,39,45],[34,0,34,45],[28,1,28,2],[29,1,29,2],[30,1,30,2],[24,1,24,22],[24,24,24,45],[25,1,25,22],[25,24,25,45],[27,0,27,45],[28,3,28,45],[29,3,29,45],[30,3,30,45],[31,3,31,45],[32,3,32,45],[9,0,9,45],[31,1,31,2],[32,1,32,2],[33,0,33,45],[23,1,23,22],[23,24,23,45],[18,1,18,22],[14,1,14,22],[14,24,14,45],[21,1,21,22],[21,24,21,45],[22,1,22,22],[22,24,22,45],[15,1,15,22],[15,24,15,45],[19,1,19,22],[19,24,19,45],[20,1,20,22],[10,0,10,45],[12,0,12,45],[13,1,13,22],[13,24,13,45],[16,1,16,22],[16,24,16,45],[17,1,17,22],[17,24,17,45],[18,24,18,45],[20,24,20,45],[0,0,0,45],[1,0,1,45],[2,0,2,22],[2,23,2,29],[2,30,2,45],[5,30,5,45],[5,47,6,48],[6,0,6,45],[7,0,7,45],[7,47,8,47],[7,48,8,48],[8,0,8,45],[3,0,5,22],[3,23,3,29],[3,30,4,45],[4,23,4,29],[5,23,5,29]]}
["Baccalauréat professionnel « maintenance des équipements industriels »"]
["Épreuve E33 (Unité U33) : Maintenance d’un système automatisé"]
["Établissement : (tampon)",null,null,null,null,null,null,null,null,null,null,null,null,null,null,null,null,null,null,null,null,null,null,"Session : "]
[null,null,null,null,null,null,null,null,null,null,null,null,null,null,null,null,null,null,null,null,null,null,null,"Nom du candidat:"]
[null,null,null,null,null,null,null,null,null,null,null,null,null,null,null,null,null,null,null,null,null,null,null,"Prénom : "]
[null,null,null,null,null,null,null,null,null,null,null,null,null,null,null,null,null,null,null,null,null,null,null,"Date de l'évaluation:",null,null,null,null,null,null,null,null,null,null,null,null,null,null,null,null,null,null,null,null,null,null,null,"Situation d'évaluation :"]
["Lieu d’évaluation :"]
["      Etablissement",null,null,null,null,null,null,null,null,null,null,null,null,null,null,null,null,null,null,null,null,null,null,null,null,null,null,null,null,null,null,null,null,null,null,null,null,null,null,null,null,null,null,null,null,null,null,"E 33","E"]
["      Entreprise :       "]
["Description sommaire du travail demandé :"]
[]
[]
["Données fournies au candidat"]
["X","Un bien en panne totale ou partielle.",null,null,null,null,null,null,null,null,null,null,null,null,null,null,null,null,null,null,null,null,null,"X","Le bon de travail."]
["X","Le dossier technique du bien et son dossier de maintenance sur supports papiers ou supports numériques",null,null,null,null,null,null,null,null,null,null,null,null,null,null,null,null,null,null,null,null,null,"X","Toutes informations en provenance de l’utilisateur ou d’autres intervenants"]
["X","Les Consignes et/ou les procédures écrites",null,null,null,null,null,null,null,null,null,null,null,null,null,null,null,null,null,null,null,null,null,"X","La description des évènements par l’exploitant"]
["X","Le dossier historique du bien.",null,null,null,null,null,null,null,null,null,null,null,null,null,null,null,null,null,null,null,null,null,"X","La documentation technique du bien."]
["X","Document unique d’évaluation des risques",null,null,null,null,null,null,null,null,null,null,null,null,null,null,null,null,null,null,null,null,null,"X","Le plan de prévention"]
["X"," Eventuellement une aide au diagnostic :\n- Tableau cause/effet\n- Organigramme de défaillance\n- Diagramme cause/effet – AMPEC, - AMDE…\n",null,null,null,null,null,null,null,null,null,null,null,null,null,null,null,null,null,null,null,null,null,"X","Les moyens d’investigation :\nConsole de programmation maintenance.\nLes appareils de mesure, de contrôle, moyens de manutention.\n"]
["X","Les outillages nécessaires.",null,null,null,null,null,null,null,null,null,null,null,null,null,null,null,null,null,null,null,null,null,"X","Les  documentations constructeur spécifiques"]
["X","Les pièces de rechange, consommables",null,null,null,null,null,null,null,null,null,null,null,null,null,null,null,null,null,null,null,null,null,"X","Le plan d’implantation du bien"]
["X","Les équipements de protection individuels et collectifs",null,null,null,null,null,null,null,null,null,null,null,null,null,null,null,null,null,null,null,null,null,"X","Les équipements individuels de sécurité"]
["X","Le planning des interventions",null,null,null,null,null,null,null,null,null,null,null,null,null,null,null,null,null,null,null,null,null,"X","Les documents utilisateurs du ou des postes de travail."]
["X","Le dossier de préparation",null,null,null,null,null,null,null,null,null,null,null,null,null,null,null,null,null,null,null,null,null,"X","Le document de recette"]
["X","Les normes",null,null,null,null,null,null,null,null,null,null,null,null,null,null,null,null,null,null,null,null,null,"X","Le plan de prévention"]
["X","Le Carnet de prescription de sécurité électrique"]
["     ÇRepérer les données fournies",null,null,null,null,null,null,null,null,null,null,null,null,null,null,null,null,null,null,null,null,null,null,null,"ÇRepérer les données fournies"]
["Travail demandé"]
["X","A1-T1",null,"Réaliser la maintenance corrective - Diagnostiquer les pannes."]
["X","A1-T3",null,"Réaliser la maintenance corrective - Réaliser des réparations, des dépannages dans les domaines : mécanique, électrique, pneumatique, hydraulique. "]
["X","A2-T2",null,"Réaliser la maintenance préventive - Réaliser des opérations planifiées."]
["X","A4-T1",null,"Intégrer de nouveaux biens - Installer de nouveaux biens."]
["X","A4-T2",null,"Intégrer de nouveaux biens - Mettre en service de nouveaux biens"]
["L’ENSEMBLE DES ACTIVITES ET DES TACHES SONT MOBILISEES EN CE QUI CONCERNE LA COMPETENCE CP1.7 QUI A TRAIT A LA SECURITE ET A LA PREVENTION DES RISQUES"]
["Consulter le référentiel des activités professionnelles pour obtenir le détail des tâches."]
["Ç Repérer les tâches demandées (ce sont celles qui correspondent à l’unité dans le référentiel de certification, à l’exclusion de toute autre)"]
["Appréciation globale et proposition de note : "]
[]
["Noms et signatures des évaluateurs :\n\n\n",null,null,null,null,null,null,null,null,null,null,null,null,null,null,null,null,null,null,null,null,null,null,null,null,null,null,null,null,null,null,null,null,null,null,"Note proposée :          ",null,null,null,null,null,null,null,"/20"]
[null,null,null,null,null,null,null,null,null,null,null,null,null,null,null,null,null,null,null,null,null,null,null,null,null,null,null,null,null,null,null,null,null,null,null,"Note affectée de son coefficient :",null,null,null,null,null,null,null,"/60"]

{"sheet":"U33_F","index":38,"n_rows":40,"n_cols":49,"rows_kept":40,"cut":false,"hidden":true,"merged":[[39,35,39,39],[39,40,39,42],[39,43,39,45],[28,3,28,45],[29,3,29,45],[30,3,30,45],[31,3,31,45],[32,3,32,45],[37,0,37,45],[36,0,36,45],[38,0,39,34],[38,35,38,39],[38,40,38,42],[38,43,38,45],[31,1,31,2],[32,1,32,2],[33,0,33,45],[34,0,34,45],[28,1,28,2],[29,1,29,2],[30,1,30,2],[24,1,24,22],[24,24,24,45],[25,1,25,22],[25,24,25,45],[27,0,27,45],[23,1,23,22],[23,24,23,45],[18,1,18,22],[18,24,18,45],[19,1,19,22],[19,24,19,45],[20,1,20,22],[20,24,20,45],[14,1,14,22],[14,24,14,45],[21,1,21,22],[21,24,21,45],[22,1,22,22],[22,24,22,45],[15,1,15,22],[15,24,15,45],[16,1,16,22],[16,24,16,45],[17,1,17,22],[17,24,17,45],[9,0,9,45],[10,0,10,45],[12,0,12,45],[13,1,13,22],[13,24,13,45],[0,0,0,45],[1,0,1,45],[2,0,2,22],[2,23,2,29],[2,30,2,45],[5,30,5,45],[5,47,6,48],[6,0,6,45],[7,0,7,45],[7,47,8,47],[7,48,8,48],[8,0,8,45],[3,0,5,22],[3,23,3,29],[3,30,4,45],[4,23,4,29],[5,23,5,29]]}
["Baccalauréat professionnel « maintenance des équipements industriels »"]
["Épreuve E33 (Unité U33) : Maintenance d’un système automatisé"]
["Établissement : (tampon)",null,null,null,null,null,null,null,null,null,null,null,null,null,null,null,null,null,null,null,null,null,null,"Session : "]
[null,null,null,null,null,null,null,null,null,null,null,null,null,null,null,null,null,null,null,null,null,null,null,"Nom du candidat:"]
[null,null,null,null,null,null,null,null,null,null,null,null,null,null,null,null,null,null,null,null,null,null,null,"Prénom : "]
[null,null,null,null,null,null,null,null,null,null,null,null,null,null,null,null,null,null,null,null,null,null,null,"Date de l'évaluation:",null,null,null,null,null,null,null,null,null,null,null,null,null,null,null,null,null,null,null,null,null,null,null,"Situation d'évaluation :"]
["Lieu d’évaluation :"]
["      Etablissement",null,null,null,null,null,null,null,null,null,null,null,null,null,null,null,null,null,null,null,null,null,null,null,null,null,null,null,null,null,null,null,null,null,null,null,null,null,null,null,null,null,null,null,null,null,null,"E 33","F"]
["      Entreprise :       "]
["Description sommaire du travail demandé :"]
[]
[]
["Données fournies au candidat"]
["X","Un bien en panne totale ou partielle.",null,null,null,null,null,null,null,null,null,null,null,null,null,null,null,null,null,null,null,null,null,"X","Le bon de travail."]
["X","Le dossier technique du bien et son dossier de maintenance sur supports papiers ou supports numériques",null,null,null,null,null,null,null,null,null,null,null,null,null,null,null,null,null,null,null,null,null,"X","Toutes informations en provenance de l’utilisateur ou d’autres intervenants"]
["X","Les Consignes et/ou les procédures écrites",null,null,null,null,null,null,null,null,null,null,null,null,null,null,null,null,null,null,null,null,null,"X","La description des évènements par l’exploitant"]
["X","Le dossier historique du bien.",null,null,null,null,null,null,null,null,null,null,null,null,null,null,null,null,null,null,null,null,null,"X","La documentation technique du bien."]
["X","Document unique d’évaluation des risques",null,null,null,null,null,null,null,null,null,null,null,null,null,null,null,null,null,null,null,null,null,"X","Le plan de prévention"]
["X"," Eventuellement une aide au diagnostic :\n- Tableau cause/effet\n- Organigramme de défaillance\n- Diagramme cause/effet – AMPEC, - AMDE…\n",null,null,null,null,null,null,null,null,null,null,null,null,null,null,null,null,null,null,null,null,null,"X","Les moyens d’investigation :\nConsole de programmation maintenance.\nLes appareils de mesure, de contrôle, moyens de manutention.\n"]
["X","Les outillages nécessaires.",null,null,null,null,null,null,null,null,null,null,null,null,null,null,null,null,null,null,null,null,null,"X","Les  documentations constructeur spécifiques"]
["X","Les pièces de rechange, consommables",null,null,null,null,null,null,null,null,null,null,null,null,null,null,null,null,null,null,null,null,null,"X","Le plan d’implantation du bien"]
["X","Les équipements de protection individuels et collectifs",null,null,null,null,null,null,null,null,null,null,null,null,null,null,null,null,null,null,null,null,null,"X","Les équipements individuels de sécurité"]
["X","Le planning des interventions",null,null,null,null,null,null,null,null,null,null,null,null,null,null,null,null,null,null,null,null,null,"X","Les documents utilisateurs du ou des postes de travail."]
["X","Le dossier de préparation",null,null,null,null,null,null,null,null,null,null,null,null,null,null,null,null,null,null,null,null,null,"X","Le document de recette"]
["X","Les normes",null,null,null,null,null,null,null,null,null,null,null,null,null,null,null,null,null,null,null,null,null,"X","Le plan de prévention"]
["X","Le Carnet de prescription de sécurité électrique"]
["     ÇRepérer les données fournies",null,null,null,null,null,null,null,null,null,null,null,null,null,null,null,null,null,null,null,null,null,null,null,"ÇRepérer les données fournies"]
["Travail demandé"]
["X","A1-T1",null,"Réaliser la maintenance corrective - Diagnostiquer les pannes."]
["X","A1-T3",null,"Réaliser la maintenance corrective - Réaliser des réparations, des dépannages dans les domaines : mécanique, électrique, pneumatique, hydraulique. "]
["X","A2-T2",null,"Réaliser la maintenance préventive - Réaliser des opérations planifiées."]
["X","A4-T1",null,"Intégrer de nouveaux biens - Installer de nouveaux biens."]
["X","A4-T2",null,"Intégrer de nouveaux biens - Mettre en service de nouveaux biens"]
["L’ENSEMBLE DES ACTIVITES ET DES TACHES SONT MOBILISEES EN CE QUI CONCERNE LA COMPETENCE CP1.7 QUI A TRAIT A LA SECURITE ET A LA PREVENTION DES RISQUES"]
["Consulter le référentiel des activités professionnelles pour obtenir le détail des tâches."]
["Ç Repérer les tâches demandées (ce sont celles qui correspondent à l’unité dans le référentiel de certification, à l’exclusion de toute autre)"]
["Appréciation globale et proposition de note : "]
[]
["Noms et signatures des évaluateurs :\n\n\n",null,null,null,null,null,null,null,null,null,null,null,null,null,null,null,null,null,null,null,null,null,null,null,null,null,null,null,null,null,null,null,null,null,null,"Note proposée :          ",null,null,null,null,null,null,null,"/20"]
[null,null,null,null,null,null,null,null,null,null,null,null,null,null,null,null,null,null,null,null,null,null,null,null,null,null,null,null,null,null,null,null,null,null,null,"Note affectée de son coefficient :",null,null,null,null,null,null,null,"/60"]

{"sheet":"U33_G","index":39,"n_rows":40,"n_cols":49,"rows_kept":40,"cut":false,"hidden":true,"merged":[[39,35,39,39],[39,40,39,42],[39,43,39,45],[28,3,28,45],[29,3,29,45],[30,3,30,45],[31,3,31,45],[32,3,32,45],[37,0,37,45],[36,0,36,45],[38,0,39,34],[38,35,38,39],[38,40,38,42],[38,43,38,45],[31,1,31,2],[32,1,32,2],[33,0,33,45],[34,0,34,45],[28,1,28,2],[29,1,29,2],[30,1,30,2],[24,1,24,22],[24,24,24,45],[25,1,25,22],[25,24,25,45],[27,0,27,45],[23,1,23,22],[23,24,23,45],[18,1,18,22],[18,24,18,45],[19,1,19,22],[19,24,19,45],[20,1,20,22],[20,24,20,45],[14,1,14,22],[14,24,14,45],[21,1,21,22],[21,24,21,45],[22,1,22,22],[22,24,22,45],[15,1,15,22],[15,24,15,45],[16,1,16,22],[16,24,16,45],[17,1,17,22],[17,24,17,45],[9,0,9,45],[10,0,10,45],[12,0,12,45],[13,1,13,22],[13,24,13,45],[0,0,0,45],[1,0,1,45],[2,0,2,22],[2,23,2,29],[2,30,2,45],[5,30,5,45],[5,47,6,48],[6,0,6,45],[7,0,7,45],[7,47,8,47],[7,48,8,48],[8,0,8,45],[3,0,5,22],[3,23,3,29],[3,30,4,45],[4,23,4,29],[5,23,5,29]]}
["Baccalauréat professionnel « maintenance des équipements industriels »"]
["Épreuve E33 (Unité U33) : Maintenance d’un système automatisé"]
["Établissement : (tampon)",null,null,null,null,null,null,null,null,null,null,null,null,null,null,null,null,null,null,null,null,null,null,"Session : "]
[null,null,null,null,null,null,null,null,null,null,null,null,null,null,null,null,null,null,null,null,null,null,null,"Nom du candidat:"]
[null,null,null,null,null,null,null,null,null,null,null,null,null,null,null,null,null,null,null,null,null,null,null,"Prénom : "]
[null,null,null,null,null,null,null,null,null,null,null,null,null,null,null,null,null,null,null,null,null,null,null,"Date de l'évaluation:",null,null,null,null,null,null,null,null,null,null,null,null,null,null,null,null,null,null,null,null,null,null,null,"Situation d'évaluation :"]
["Lieu d’évaluation :"]
["      Etablissement",null,null,null,null,null,null,null,null,null,null,null,null,null,null,null,null,null,null,null,null,null,null,null,null,null,null,null,null,null,null,null,null,null,null,null,null,null,null,null,null,null,null,null,null,null,null,"E 33","G"]
["      Entreprise :       "]
["Description sommaire du travail demandé :"]
[]
[]
["Données fournies au candidat"]
["X","Un bien en panne totale ou partielle.",null,null,null,null,null,null,null,null,null,null,null,null,null,null,null,null,null,null,null,null,null,"X","Le bon de travail."]
["X","Le dossier technique du bien et son dossier de maintenance sur supports papiers ou supports numériques",null,null,null,null,null,null,null,null,null,null,null,null,null,null,null,null,null,null,null,null,null,"X","Toutes informations en provenance de l’utilisateur ou d’autres intervenants"]
["X","Les Consignes et/ou les procédures écrites",null,null,null,null,null,null,null,null,null,null,null,null,null,null,null,null,null,null,null,null,null,"X","La description des évènements par l’exploitant"]
["X","Le dossier historique du bien.",null,null,null,null,null,null,null,null,null,null,null,null,null,null,null,null,null,null,null,null,null,"X","La documentation technique du bien."]
["X","Document unique d’évaluation des risques",null,null,null,null,null,null,null,null,null,null,null,null,null,null,null,null,null,null,null,null,null,"X","Le plan de prévention"]
["X"," Eventuellement une aide au diagnostic :\n- Tableau cause/effet\n- Organigramme de défaillance\n- Diagramme cause/effet – AMPEC, - AMDE…\n",null,null,null,null,null,null,null,null,null,null,null,null,null,null,null,null,null,null,null,null,null,"X","Les moyens d’investigation :\nConsole de programmation maintenance.\nLes appareils de mesure, de contrôle, moyens de manutention.\n"]
["X","Les outillages nécessaires.",null,null,null,null,null,null,null,null,null,null,null,null,null,null,null,null,null,null,null,null,null,"X","Les  documentations constructeur spécifiques"]
["X","Les pièces de rechange, consommables",null,null,null,null,null,null,null,null,null,null,null,null,null,null,null,null,null,null,null,null,null,"X","Le plan d’implantation du bien"]
["X","Les équipements de protection individuels et collectifs",null,null,null,null,null,null,null,null,null,null,null,null,null,null,null,null,null,null,null,null,null,"X","Les équipements individuels de sécurité"]
["X","Le planning des interventions",null,null,null,null,null,null,null,null,null,null,null,null,null,null,null,null,null,null,null,null,null,"X","Les documents utilisateurs du ou des postes de travail."]
["X","Le dossier de préparation",null,null,null,null,null,null,null,null,null,null,null,null,null,null,null,null,null,null,null,null,null,"X","Le document de recette"]
["X","Les normes",null,null,null,null,null,null,null,null,null,null,null,null,null,null,null,null,null,null,null,null,null,"X","Le plan de prévention"]
["X","Le Carnet de prescription de sécurité électrique"]
["     ÇRepérer les données fournies",null,null,null,null,null,null,null,null,null,null,null,null,null,null,null,null,null,null,null,null,null,null,null,"ÇRepérer les données fournies"]
["Travail demandé"]
["X","A1-T1",null,"Réaliser la maintenance corrective - Diagnostiquer les pannes."]
["X","A1-T3",null,"Réaliser la maintenance corrective - Réaliser des réparations, des dépannages dans les domaines : mécanique, électrique, pneumatique, hydraulique. "]
["X","A2-T2",null,"Réaliser la maintenance préventive - Réaliser des opérations planifiées."]
["X","A4-T1",null,"Intégrer de nouveaux biens - Installer de nouveaux biens."]
["X","A4-T2",null,"Intégrer de nouveaux biens - Mettre en service de nouveaux biens"]
["L’ENSEMBLE DES ACTIVITES ET DES TACHES SONT MOBILISEES EN CE QUI CONCERNE LA COMPETENCE CP1.7 QUI A TRAIT A LA SECURITE ET A LA PREVENTION DES RISQUES"]
["Consulter le référentiel des activités professionnelles pour obtenir le détail des tâches."]
["Ç Repérer les tâches demandées (ce sont celles qui correspondent à l’unité dans le référentiel de certification, à l’exclusion de toute autre)"]
["Appréciation globale et proposition de note : "]
[]
["Noms et signatures des évaluateurs :\n\n\n",null,null,null,null,null,null,null,null,null,null,null,null,null,null,null,null,null,null,null,null,null,null,null,null,null,null,null,null,null,null,null,null,null,null,"Note proposée :          ",null,null,null,null,null,null,null,"/20"]
[null,null,null,null,null,null,null,null,null,null,null,null,null,null,null,null,null,null,null,null,null,null,null,null,null,null,null,null,null,null,null,null,null,null,null,"Note affectée de son coefficient :",null,null,null,null,null,null,null,"/60"]

{"sheet":"U33_H","index":40,"n_rows":40,"n_cols":49,"rows_kept":40,"cut":false,"hidden":true,"merged":[[23,1,23,22],[23,24,23,45],[18,1,18,22],[18,24,18,45],[19,1,19,22],[19,24,19,45],[20,1,20,22],[22,1,22,22],[22,24,22,45],[28,1,28,2],[29,1,29,2],[30,1,30,2],[24,1,24,22],[24,24,24,45],[25,1,25,22],[25,24,25,45],[27,0,27,45],[28,3,28,45],[29,3,29,45],[30,3,30,45],[37,0,37,45],[39,35,39,39],[39,40,39,42],[39,43,39,45],[31,1,31,2],[32,1,32,2],[34,0,34,45],[36,0,36,45],[38,0,39,34],[38,35,38,39],[38,40,38,42],[38,43,38,45],[33,0,33,45],[31,3,31,45],[32,3,32,45],[14,1,14,22],[14,24,14,45],[21,1,21,22],[21,24,21,45],[10,0,10,45],[12,0,12,45],[13,1,13,22],[13,24,13,45],[15,1,15,22],[15,24,15,45],[16,1,16,22],[16,24,16,45],[17,1,17,22],[17,24,17,45],[20,24,20,45],[9,0,9,45],[0,0,0,45],[1,0,1,45],[2,0,2,22],[2,23,2,29],[2,30,2,45],[5,30,5,45],[5,47,6,48],[6,0,6,45],[7,0,7,45],[7,47,8,47],[7,48,8,48],[8,0,8,45],[3,0,5,22],[3,23,3,29],[3,30,4,45],[4,23,4,29],[5,23,5,29]]}
["Baccalauréat professionnel « maintenance des équipements industriels »"]
["Épreuve E33 (Unité U33) : Maintenance d’un système automatisé"]
["Établissement : (tampon)",null,null,null,null,null,null,null,null,null,null,null,null,null,null,null,null,null,null,null,null,null,null,"Session : "]
[null,null,null,null,null,null,null,null,null,null,null,null,null,null,null,null,null,null,null,null,null,null,null,"Nom du candidat:"]
[null,null,null,null,null,null,null,null,null,null,null,null,null,null,null,null,null,null,null,null,null,null,null,"Prénom : "]
[null,null,null,null,null,null,null,null,null,null,null,null,null,null,null,null,null,null,null,null,null,null,null,"Date de l'évaluation:",null,null,null,null,null,null,null,null,null,null,null,null,null,null,null,null,null,null,null,null,null,null,null,"Situation d'évaluation :"]
["Lieu d’évaluation :"]
["      Etablissement",null,null,null,null,null,null,null,null,null,null,null,null,null,null,null,null,null,null,null,null,null,null,null,null,null,null,null,null,null,null,null,null,null,null,null,null,null,null,null,null,null,null,null,null,null,null,"E 33","H"]
["      Entreprise :       "]
["Description sommaire du travail demandé :"]
[]
[]
["Données fournies au candidat"]
["X","Un bien en panne totale ou partielle.",null,null,null,null,null,null,null,null,null,null,null,null,null,null,null,null,null,null,null,null,null,"X","Le bon de travail."]
["X","Le dossier technique du bien et son dossier de maintenance sur supports papiers ou supports numériques",null,null,null,null,null,null,null,null,null,null,null,null,null,null,null,null,null,null,null,null,null,"X","Toutes informations en provenance de l’utilisateur ou d’autres intervenants"]
["X","Les Consignes et/ou les procédures écrites",null,null,null,null,null,null,null,null,null,null,null,null,null,null,null,null,null,null,null,null,null,"X","La description des évènements par l’exploitant"]
["X","Le dossier historique du bien.",null,null,null,null,null,null,null,null,null,null,null,null,null,null,null,null,null,null,null,null,null,"X","La documentation technique du bien."]
["X","Document unique d’évaluation des risques",null,null,null,null,null,null,null,null,null,null,null,null,null,null,null,null,null,null,null,null,null,"X","Le plan de prévention"]
["X"," Eventuellement une aide au diagnostic :\n- Tableau cause/effet\n- Organigramme de défaillance\n- Diagramme cause/effet – AMPEC, - AMDE…\n",null,null,null,null,null,null,null,null,null,null,null,null,null,null,null,null,null,null,null,null,null,"X","Les moyens d’investigation :\nConsole de programmation maintenance.\nLes appareils de mesure, de contrôle, moyens de manutention.\n"]
["X","Les outillages nécessaires.",null,null,null,null,null,null,null,null,null,null,null,null,null,null,null,null,null,null,null,null,null,"X","Les  documentations constructeur spécifiques"]
["X","Les pièces de rechange, consommables",null,null,null,null,null,null,null,null,null,null,null,null,null,null,null,null,null,null,null,null,null,"X","Le plan d’implantation du bien"]
["X","Les équipements de protection individuels et collectifs",null,null,null,null,null,null,null,null,null,null,null,null,null,null,null,null,null,null,null,null,null,"X","Les équipements individuels de sécurité"]
["X","Le planning des interventions",null,null,null,null,null,null,null,null,null,null,null,null,null,null,null,null,null,null,null,null,null,"X","Les documents utilisateurs du ou des postes de travail."]
["X","Le dossier de préparation",null,null,null,null,null,null,null,null,null,null,null,null,null,null,null,null,null,null,null,null,null,"X","Le document de recette"]
["X","Les normes",null,null,null,null,null,null,null,null,null,null,null,null,null,null,null,null,null,null,null,null,null,"X","Le plan de prévention"]
["X","Le Carnet de prescription de sécurité électrique"]
["     ÇRepérer les données fournies",null,null,null,null,null,null,null,null,null,null,null,null,null,null,null,null,null,null,null,null,null,null,null,"ÇRepérer les données fournies"]
["Travail demandé"]
["X","A1-T1",null,"Réaliser la maintenance corrective - Diagnostiquer les pannes."]
["X","A1-T3",null,"Réaliser la maintenance corrective - Réaliser des réparations, des dépannages dans les domaines : mécanique, électrique, pneumatique, hydraulique. "]
["X","A2-T2",null,"Réaliser la maintenance préventive - Réaliser des opérations planifiées."]
["X","A4-T1",null,"Intégrer de nouveaux biens - Installer de nouveaux biens."]
["X","A4-T2",null,"Intégrer de nouveaux biens - Mettre en service de nouveaux biens"]
["L’ENSEMBLE DES ACTIVITES ET DES TACHES SONT MOBILISEES EN CE QUI CONCERNE LA COMPETENCE CP1.7 QUI A TRAIT A LA SECURITE ET A LA PREVENTION DES RISQUES"]
["Consulter le référentiel des activités professionnelles pour obtenir le détail des tâches."]
["Ç Repérer les tâches demandées (ce sont celles qui correspondent à l’unité dans le référentiel de certification, à l’exclusion de toute autre)"]
["Appréciation globale et proposition de note : "]
[]
["Noms et signatures des évaluateurs :\n\n\n",null,null,null,null,null,null,null,null,null,null,null,null,null,null,null,null,null,null,null,null,null,null,null,null,null,null,null,null,null,null,null,null,null,null,"Note proposée :          ",null,null,null,null,null,null,null,"/20"]
[null,null,null,null,null,null,null,null,null,null,null,null,null,null,null,null,null,null,null,null,null,null,null,null,null,null,null,null,null,null,null,null,null,null,null,"Note affectée de son coefficient :",null,null,null,null,null,null,null,"/60"]